{"text_format":"1","workbook":"xlsx","n_sheets":9,"sheets":["Menu","Disclaimer","Definitie Criteria","PrijsKwaliteit","Paarsgewijs vergelijk","Einde Verdeling","Parameters","Grafiek","Analyse"],"not_rendered":{"charts":8,"images":9,"macros":1,"external_links":0,"defined_names":73,"comments":0,"pivot_tables":0},"unopened":[],"bounds":{"document_bytes":16777216,"sheet_cells":100000,"rows_first":2000,"rows_last":500,"rows_between":2000,"halvings":0,"cell_chars":16384,"cell_head_chars":4096},"cells_cut":0,"cells_raw":0,"read":"whole","date_system":"1900"}

{"sheet":"Menu","index":0,"n_rows":12,"n_cols":18,"rows_kept":12,"cut":false,"hidden":false,"merged":[[11,3,11,6],[10,3,10,6],[9,8,9,9]]}
[]
[]
[]
[]
[]
[]
[]
[]
[null,null,null,null,null,null,null,null,null,null,null,null,null,null,null,null,null,"versie 1.5"]
[null,null,null,null,null,null,null,null,null,null,null,null,null,null,null,null,null,"juni 2019"]
[null,null,"Kenmerk:",null,null,null,null,null,null,null,null,null,null,null,null,"Aantal criteria kwaliteit:",{"$f":"+'Definitie Criteria'!P15","v":0}]
[null,null,"Naam: ",null,null,null,null,null,null,null,null,null,null,null,null,"Prijscriterium actief:",{"$f":"+xPrijscriterium","v":0}]

{"sheet":"Disclaimer","index":1,"n_rows":28,"n_cols":13,"rows_kept":28,"cut":false,"hidden":false,"merged":[[27,12,27,15]]}
[]
[]
[null,null,"bf"]
[]
[]
[]
[]
[]
[]
[]
[]
[]
[null,null,"Disclaimer"]
[]
[]
[]
[]
[]
[]
[]
[]
[]
[]
[]
[]
[null,null,null,null,null,null,null,null,null,null,null,null,"© Juni 2019"]
[null,null,null,null,null,null,null,null,null,null,null,null,"IUC - Belastingdienst"]
[null,null,null,null,null,null,null,null,null,null,null,null,"procurement.economics@belastingdienst.nl"]

{"sheet":"Definitie Criteria","index":2,"n_rows":23,"n_cols":16,"rows_kept":23,"cut":false,"hidden":false,"merged":[[10,12,10,15],[11,12,11,15],[20,4,20,11],[22,4,22,11],[21,4,21,11],[15,4,15,11],[16,4,16,11],[17,4,17,11],[18,4,18,11],[19,4,19,11],[14,4,14,11],[19,2,19,3],[20,2,20,3],[21,2,21,3],[22,2,22,3],[14,2,14,3],[15,2,15,3],[16,2,16,3],[17,2,17,3],[18,2,18,3]]}
[]
[]
[]
[]
[]
[]
[]
[]
[]
[]
[null,null,null,null,null,null,null,null,null,null,null,"Nummer:",{"$f":"+Menu!D11","v":0}]
[null,null,null,null,null,null,null,null,null,null,null,"Naam: ",{"$f":"+Menu!D12","v":0}]
[null,null,"Gunningscriteria",null,"Toelichting"]
[]
[null,"criterium 1",null,null,null,null,null,null,null,null,null,null,null,null,"Aantal Criteria: ",{"$f":"9-((COUNTBLANK($C$15:$C$23)))","v":0}]
[null,"criterium 2"]
[null,"criterium 3"]
[null,"criterium 4"]
[null,"criterium 5"]
[null,"criterium 6"]
[null,"criterium 7"]
[null,"criterium 8"]
[null,"criterium 9"]

{"sheet":"PrijsKwaliteit","index":3,"n_rows":23,"n_cols":13,"rows_kept":23,"cut":false,"hidden":false,"merged":[[10,2,11,4],[10,12,10,15],[11,12,11,15]]}
[]
[]
[]
[]
[]
[]
[]
[]
[]
[]
[null,null,"Verhouding prijs / kwaliteit",null,null,null,null,null,null,null,null,"Nummer:",{"$f":"+Menu!D11","v":0}]
[null,null,null,null,null,null,null,null,null,null,null,"Naam: ",{"$f":"+Menu!D12","v":0}]
[null,null,null,"Ja"," "]
[null,null,null,"Nee"," "]
[null,null,"Criterium prijs actief --------->","Nee"]
[]
[]
[null,null,"Criterium","Percentage"]
[null,null,"Prijs",{"$f":"Parameters!M20/100","v":0.59}]
[null,null,"Kwaliteit",{"$f":"1-(Parameters!M20)/100","v":0.41000000000000003}]
[]
[]
[null,null,"Kwaliteit","   Prijs",null," "]

{"sheet":"Paarsgewijs vergelijk","index":4,"n_rows":28,"n_cols":17,"rows_kept":28,"cut":false,"hidden":false,"merged":[[27,3,28,8],[14,3,15,8],[10,2,11,12]]}
[]
[]
[]
[]
[]
[]
[]
[]
[]
[]
[null,null,"Paarsgewijs vergelijken"]
[]
[]
[null,null,null,{"$f":"VLOOKUP(Parameters!$K$42,Parameters!$D$15:$E$23,2,FALSE)","v":0}]
[null,null,null,{"$f":"VLOOKUP(Parameters!$K$42,Parameters!$D$25:$E$33,2,FALSE)","v":0}]
[]
[null,null,null,null,null,{"$f":"VLOOKUP(Parameters!$N$23,Parameters!$O$14:$P$30,2,FALSE)","v":5}]
[]
[]
[null,null,null,null,null,null,null,null,null,null,null,null,null," "," "," "," "]
[]
[]
[null,null,null,null,null,null,null,null,null,null," ",null," "]
[]
[null,null," "]
[null,null,null,null,null,{"$f":"VLOOKUP(Parameters!$N$24,Parameters!$O$14:$P$30,2,FALSE)","v":"1/5"}]
[null,null,null,{"$f":"VLOOKUP(Parameters!$K$43,Parameters!$D$15:$E$23,2,FALSE)","v":0}]
[null,null,null,{"$f":"VLOOKUP(Parameters!$K$43,Parameters!$D$25:$E$33,2,FALSE)","v":0}]

{"sheet":"Einde Verdeling","index":5,"n_rows":11,"n_cols":14,"rows_kept":11,"cut":false,"hidden":false,"merged":[[9,13,9,16],[10,13,10,16]]}
[]
[]
[]
[]
[]
[]
[]
[]
[]
[null,null,null,null,null,null,null,null,null,null,null,null,"Nummer:",{"$f":"+Menu!D11","v":0}]
[null,null,null,null,null,null,null,null,null,null,null,null,"Naam:",{"$f":"+Menu!D12","v":0}]

{"sheet":"Parameters","index":6,"n_rows":345,"n_cols":31,"rows_kept":345,"cut":false,"hidden":false,"merged":[[243,1,243,2],[180,1,180,2],[181,1,181,2],[182,1,182,2],[183,1,183,2],[184,1,184,2],[186,1,186,2],[185,1,185,2],[159,1,159,2],[94,1,94,2],[95,1,95,2],[96,1,96,2],[131,1,131,2],[132,1,132,2],[154,1,154,2],[157,1,157,2],[158,1,158,2],[133,1,133,2],[134,1,134,2],[135,1,135,2],[155,1,155,2],[156,1,156,2],[248,1,248,2],[249,1,249,2],[209,1,209,2],[210,1,210,2],[211,1,211,2],[212,1,212,2],[213,1,213,2],[241,1,241,2],[214,1,214,2],[215,1,215,2],[216,1,216,2],[246,1,246,2],[247,1,247,2],[244,1,244,2],[245,1,245,2],[242,1,242,2],[88,23,88,24],[123,23,123,24],[104,23,104,24],[93,23,93,24],[111,1,111,2],[112,1,112,2],[113,1,113,2],[114,1,114,2],[110,23,110,24],[179,23,179,24],[153,23,153,24],[130,23,130,24],[229,23,229,24],[198,23,198,24],[170,23,170,24],[145,23,145,24],[325,5,325,6],[327,5,327,6],[332,5,332,6],[240,23,240,24],[208,23,208,24]]}
[]
[]
[]
[]
[]
[]
[]
[]
[]
[]
[null,"Parameters"]
[]
[null,"Aantal criteria",null,null,{"$f":"+'Definitie Criteria'!P15","v":0},null,null,null,null,null,"Kleuren",null,"zwart",null,null,null,null,"Output schuifbalk"]
[null,null,null,null,null,null,null,null,null,null,"van ",null,"wit",null,9,9,null,1,-9]
[null,"Criteria 1",null,1,{"$f":"+'Definitie Criteria'!$C$15","v":0},"Criteria 1",null,null,null,null,"cel",null,null,null,8,8,null,2,-8]
[null,"Criteria 2",null,2,{"$f":"+'Definitie Criteria'!$C$16","v":0},"Criteria 2",null,null,null,null,null,null,null,null,7,7,null,3,-7]
[null,"Criteria 3",null,3,{"$f":"+'Definitie Criteria'!$C$17","v":0},"Criteria 3",null,null,null,null,null,null,null,null,6,6,null,4,-6]
[null,"Criteria 4",null,4,{"$f":"+'Definitie Criteria'!$C$18","v":0},"Criteria 4",null,null,null,null,"Ja",null,null,null,5,5,null,5,-5]
[null,"Criteria 5",null,5,{"$f":"+'Definitie Criteria'!$C$19","v":0},"Criteria 5",null,null,null,null,"Nee",null,null,null,4,4,null,6,-4]
[null,"Criteria 6",null,6,{"$f":"+'Definitie Criteria'!$C$20","v":0},"Criteria 6",null,null,null,null,"Percentage ",null,59,null,3,3,null,7,-3]
[null,"Criteria 7",null,7,{"$f":"+'Definitie Criteria'!$C$21","v":0},"Criteria 7",null,null,null,null,"Prijs voorgedefineerd:",null,{"$f":"IF(PrijsKwaliteit!D15=\"Ja\",1,0)","v":0},null,2,2,null,8,-2]
[null,"Criteria 8",null,8,{"$f":"+'Definitie Criteria'!$C$22","v":0},"Criteria 8",null,null,null,null,null,null,null,null,1,1,null,9,1]
[null,"Criteria 9",null,9,{"$f":"+'Definitie Criteria'!$C$23","v":0},"Criteria 9",null,null,null,null,"Waardevergelijk",null,{"$f":"VLOOKUP(M25,$R$14:$S$30,2,FALSE)","v":-5},{"$f":"IF(xWaardevergelijk<0,xWaardevergelijk*-1,IF(xWaardevergelijk=0,1,1 / xWaardevergelijk))","v":5},{"$f":"1/2","v":0.5},"1/2",null,10,2]
[null,null,null,null,null,null,null,null,null,null,null,null,null,{"$f":"1/N23","v":0.2},{"$f":"1/3","v":0.33333333333333331},"1/3",null,11,3]
[null,"Criteria 1",null,1,{"$f":"+'Definitie Criteria'!E15:L15","v":0},null,null,null,null,null,"Waarde uit schuifbalk",null,5,null,{"$f":"1/4","v":0.25},"1/4",null,12,4]
[null,"Criteria 2",null,2,{"$f":"+'Definitie Criteria'!E16:L16","v":0},null,null,null,null,null,null,null,null,null,{"$f":"1/5","v":0.2},"1/5",null,13,5]
[null,"Criteria 3",null,3,{"$f":"+'Definitie Criteria'!$E$17","v":0},null,null,null,null,null,null,null,null,null,{"$f":"1/6","v":0.16666666666666666},"1/6",null,14,6]
[null,"Criteria 4",null,4,{"$f":"+'Definitie Criteria'!$E$18","v":0},null,null,null,null,null,null,null,null,null,{"$f":"1/7","v":0.14285714285714285},"1/7",null,15,7]
[null,"Criteria 5",null,5,{"$f":"+'Definitie Criteria'!$E$19","v":0},null,null,null,null,null,null,null,null,null,{"$f":"1/8","v":0.125},"1/8",null,16,8]
[null,"Criteria 6",null,6,{"$f":"+'Definitie Criteria'!$E$20","v":0},null,null,null,null,null,null,null,null,null,{"$f":"1/9","v":0.1111111111111111},"1/9",null,17,9]
[null,"Criteria 7",null,7,{"$f":"+'Definitie Criteria'!$E$21","v":0}]
[null,"Criteria 8",null,8,{"$f":"+'Definitie Criteria'!$E$22","v":0}]
[null,"Criteria 9",null,9,{"$f":"+'Definitie Criteria'!$E$23","v":0}]
[]
[]
[]
[null,"Paarsgewijs vergelijk"]
[]
[null,null,null,null,"Circel"]
[null," Aantal","Aantal ",null,"diagram"]
[null,"criteria","vergelijken",null,"voortgang",null,null,null,null,"Teller",7]
[null,2,1,null,null,null,null,null,null,"Rij",4]
[null,3,3,null,"Te gaan",{"$f":"+xNogtegaan","v":{"$error":"#N/A"}},{"$f":"G46-K41+1","v":{"$error":"#N/A"}},null,null,"Kolom",5]
[null,4,6,null,"Gedaan",{"$f":"+xGedaan","v":{"$error":"#N/A"}},{"$f":"+G46-G43","v":{"$error":"#N/A"}},null,null,"Max",{"$f":"E13","v":0}]
[null,5,10,null,null,null,null,null,null,"Maxtellr",{"$f":"VLOOKUP($E$13,$B$42:$C$49,2,FALSE)","v":{"$error":"#N/A"}}]
[null,6,15,null,"Totaal",null,{"$f":"VLOOKUP(E13,B42:C49,2,FALSE)","v":{"$error":"#N/A"}}]
[null,7,21]
[null,8,28]
[null,9,36]
[]
[]
[null,"Matrix"]
[]
[null,null,"Crieteria 1","Crieteria 2","Crieteria 3","Crieteria 4","Crieteria 5","Crieteria 6","Crieteria 7","Crieteria 8","Crieteria 9"]
[null,"Crieteria 1",1,5,5,5]
[null,"Crieteria 2",{"$f":"1/D55","v":0.2},1,5,5]
[null,"Crieteria 3",{"$f":"1/E55","v":0.2},{"$f":"1/E56","v":0.2},1,5]
[null,"Crieteria 4",{"$f":"1/F55","v":0.2},{"$f":"1/F56","v":0.2},{"$f":"1/F57","v":0.2},1]
[null,"Crieteria 5",{"$f":"1/G55","v":{"$error":"#DIV/0!"}},{"$f":"1/G56","v":{"$error":"#DIV/0!"}},{"$f":"1/G57","v":{"$error":"#DIV/0!"}},{"$f":"1/G58","v":{"$error":"#DIV/0!"}},1]
[null,"Crieteria 6",{"$f":"1/H55","v":{"$error":"#DIV/0!"}},{"$f":"1/H56","v":{"$error":"#DIV/0!"}},{"$f":"1/H57","v":{"$error":"#DIV/0!"}},{"$f":"1/H58","v":{"$error":"#DIV/0!"}},{"$f":"1/H59","v":{"$error":"#DIV/0!"}},1]
[null,"Crieteria 7",{"$f":"1/I55","v":{"$error":"#DIV/0!"}},{"$f":"1/I56","v":{"$error":"#DIV/0!"}},{"$f":"1/I57","v":{"$error":"#DIV/0!"}},{"$f":"1/I58","v":{"$error":"#DIV/0!"}},{"$f":"1/I59","v":{"$error":"#DIV/0!"}},{"$f":"1/I60","v":{"$error":"#DIV/0!"}},1]
[null,"Crieteria 8",{"$f":"1/J55","v":{"$error":"#DIV/0!"}},{"$f":"1/J56","v":{"$error":"#DIV/0!"}},{"$f":"1/J57","v":{"$error":"#DIV/0!"}},{"$f":"1/J58","v":{"$error":"#DIV/0!"}},{"$f":"1/J59","v":{"$error":"#DIV/0!"}},{"$f":"1/J60","v":{"$error":"#DIV/0!"}},{"$f":"1/J61","v":{"$error":"#DIV/0!"}},1]
[null,"Crieteria 9",{"$f":"1/K55","v":{"$error":"#DIV/0!"}},{"$f":"1/K56","v":{"$error":"#DIV/0!"}},{"$f":"1/K57","v":{"$error":"#DIV/0!"}},{"$f":"1/K58","v":{"$error":"#DIV/0!"}},{"$f":"1/K59","v":{"$error":"#DIV/0!"}},{"$f":"1/K60","v":{"$error":"#DIV/0!"}},{"$f":"1/K61","v":{"$error":"#DIV/0!"}},{"$f":"1/K62","v":{"$error":"#DIV/0!"}},1]
[]
[]
[]
[null,"Keuze"]
[]
[null,null,null,null,null,"Ouput",0]
[null,1,"meer belangrijker",null,null,1,{"$f":"VLOOKUP(F70,$B$70:$C$71,2,FALSE)","v":"meer belangrijker"}]
[null,2,"minder belangrijker"]
[]
[]
[null,1,{"$f":"\"even \" &  $G$70","v":"even meer belangrijker"}]
[null,2,{"$f":"\"fractie \" &  $G$70","v":"fractie meer belangrijker"}]
[null,3,{"$f":"\"licht \" &  $G$70","v":"licht meer belangrijker"}]
[null,4,{"$f":"\"matig tot sterk \" &  $G$70","v":"matig tot sterk meer belangrijker"}]
[null,5,{"$f":"\"Sterk \" &  $G$70","v":"Sterk meer belangrijker"}]
[null,6,{"$f":"\"Sterk tot erg sterk \" &  $G$70","v":"Sterk tot erg sterk meer belangrijker"}]
[null,7,{"$f":"\"erg sterk \" &  $G$70","v":"erg sterk meer belangrijker"}]
[null,8,{"$f":"\"sterk tot extreem\" &  $G$70","v":"sterk tot extreemmeer belangrijker"}]
[null,9,{"$f":"\"extreem \" &  $G$70","v":"extreem meer belangrijker"}]
[]
[]
[]
[]
[null,null,null,null,null,null,null,"Genormaliseerde matrix"]
[]
["Matrix 3 Criteria","Matrix",null,{"$f":"+'Definitie Criteria'!$C$15","v":0},{"$f":"+'Definitie Criteria'!$C$16","v":0},{"$f":"+'Definitie Criteria'!$C$17","v":0},null,null,null,null,null,null,null,null,null,null,null,null,null,null,null,null,null,"Criterium",null,"%",null,"Product","Ratio"]
[null,null,{"$f":"+'Definitie Criteria'!$C$15","v":0},{"$f":"+Parameters!C55","v":1},{"$f":"+Parameters!D55","v":5},{"$f":"+Parameters!E55","v":5},null,{"$f":"D90/SUM(D90:D92)","v":0.7142857142857143},{"$f":"E90/SUM(E90:E92)","v":0.80645161290322576},{"$f":"F90/SUM(F90:F92)","v":0.45454545454545453},null,null,null,null,null,null,null,null,null,null,null,null,null,null,{"$f":"+B90","v":0},{"$f":"AVERAGE(H90:J90)","v":0.65842759391146488},null,{"$f":"MMULT(D90:F92,Z90:Z92)","v":2.3662896243541409},{"$f":"AB90/Z90","v":3.5938494167550377}]
[null,null,{"$f":"+'Definitie Criteria'!$C$16","v":0},{"$f":"+Parameters!C56","v":0.2},{"$f":"+Parameters!D56","v":1},{"$f":"+Parameters!E56","v":5},null,{"$f":"D91/SUM(D90:D92)","v":0.14285714285714288},{"$f":"E91/SUM(E90:E92)","v":0.16129032258064516},{"$f":"F91/SUM(F90:F92)","v":0.45454545454545453},null,null,null,null,null,null,null,null,null,null,null,null,null,null,{"$f":"+B91","v":0},{"$f":"AVERAGE(H91:J91)","v":0.25289763999441423},null,0.82795698924731198,{"$f":"AB91/Z91","v":3.2738818332413033}]
[null,null,{"$f":"+'Definitie Criteria'!$C$17","v":0},{"$f":"+Parameters!C57","v":0.2},{"$f":"+Parameters!D57","v":0.2},{"$f":"+Parameters!E57","v":1},null,{"$f":"D92/SUM(D90:D92)","v":0.14285714285714288},{"$f":"E92/SUM(E90:E92)","v":3.2258064516129031E-2},{"$f":"F92/SUM(F90:F92)","v":9.0909090909090912E-2},null,null,null,null,null,null,null,null,null,null,null,null,null,null,{"$f":"+B92","v":0},{"$f":"AVERAGE(H92:J92)","v":8.8674766094120949E-2},null,0.27093981287529678,{"$f":"AB92/Z92","v":3.0554330708661417}]
[null,null,null,null,null,null,null,null,null,null,null,null,null,null,null,null,null,null,null,null,null,null,null,null,null,null,null,"CI=",{"$f":"(AVERAGE(AC90:AC92)-3)/2","v":0.15386072014374719},"CI/RI=",{"$f":"AC93/0.58","v":0.26527710369611585}]
["Matrix 3 Criteria (aangepast)","Optimaal",null,{"$f":"+'Definitie Criteria'!$C$15","v":0},{"$f":"+'Definitie Criteria'!$C$16","v":0},{"$f":"+'Definitie Criteria'!$C$17","v":0},null,null,null,null,null,null,null,null,null,null,null,null,null,null,null,null,null,"Criterium",null,"%",null,"Product","Ratio"]
[null,{"$f":"+'Definitie Criteria'!$C$15","v":0},{"$f":"+'Definitie Criteria'!$C$15","v":0},{"$f":"+C55","v":1},{"$f":"+D55","v":5},{"$f":"+E55","v":5},null,{"$f":"D95/SUM(D95:D97)","v":0.7142857142857143},{"$f":"E95/SUM(E95:E97)","v":0.7142857142857143},{"$f":"F95/SUM(F95:F97)","v":0.7142857142857143},null,null,null,null,null,null,null,null,null,null,null,null,null,null,{"$f":"+B95","v":0},{"$f":"AVERAGE(H95:J95)","v":0.7142857142857143},null,{"$f":"MMULT(D95:F97,Z95:Z97)","v":2.1428571428571423},{"$f":"AB95/Z95","v":2.9999999999999991}]
[null,{"$f":"+'Definitie Criteria'!$C$16","v":0},{"$f":"+'Definitie Criteria'!$C$16","v":0},{"$f":"1/E95","v":0.2},1,{"$f":"+F95/E95","v":1},null,{"$f":"D96/SUM(D95:D97)","v":0.14285714285714288},{"$f":"E96/SUM(E95:E97)","v":0.14285714285714285},{"$f":"F96/SUM(F95:F97)","v":0.14285714285714285},null,null,null,null,null,null,null,null,null,null,null,null,null,null,{"$f":"+B96","v":0},{"$f":"AVERAGE(H96:J96)","v":0.14285714285714285},null,0.42857142857142855,{"$f":"AB96/Z96","v":3}]
[null,{"$f":"+'Definitie Criteria'!$C$17","v":0},{"$f":"+'Definitie Criteria'!$C$17","v":0},{"$f":"1/F95","v":0.2},{"$f":"1/F96","v":1},1,null,{"$f":"D97/SUM(D95:D97)","v":0.14285714285714288},{"$f":"E97/SUM(E95:E97)","v":0.14285714285714285},{"$f":"F97/SUM(F95:F97)","v":0.14285714285714285},null,null,null,null,null,null,null,null,null,null,null,null,null,null,{"$f":"+B97","v":0},{"$f":"AVERAGE(H97:J97)","v":0.14285714285714285},null,0.42857142857142855,{"$f":"AB97/Z97","v":3}]
[null,null,null,null,null,null,null,null,null,null,null,null,null,null,null,null,null,null,null,null,null,null,null,null,null,null,null,"CI=",{"$f":"(AVERAGE(AC95:AC97)-3)/2","v":0},"CI/RI=",{"$f":"AC98/0.58","v":0}]
["Analyse 3","Analyse",null,{"$f":"+Parameters!$E$15","v":0},{"$f":"+Parameters!$E$16","v":0},{"$f":"+Parameters!$E$17","v":0}]
[null,null,{"$f":"+Parameters!$E$15","v":0}," ",{"$f":"ABS((E95-E90)/E95)","v":0},{"$f":"ABS((F95-F90)/F95)","v":0}]
[null,null,{"$f":"+Parameters!$E$16","v":0},null," ",{"$f":"ABS((F96-F91)/F96)","v":4}]
[null,null,{"$f":"+Parameters!$E$17","v":0},null,null," "]
[]
[null,null,null,null,null,null,null,null,"Genormaliseerde matrix"]
["Matrix 4 Criteria","Matrix",null,{"$f":"+'Definitie Criteria'!$C$15","v":0},{"$f":"+'Definitie Criteria'!$C$16","v":0},{"$f":"+'Definitie Criteria'!$C$17","v":0},{"$f":"+'Definitie Criteria'!$C$18","v":0},null,null,null,null,null,null,null,null,null,null,null,null,null,null,null,null,"Criterium",null,"%",null,"Product","Ratio"]
[null,null,{"$f":"+'Definitie Criteria'!$C$15","v":0},{"$f":"+Parameters!C55","v":1},{"$f":"+Parameters!D55","v":5},{"$f":"+Parameters!E55","v":5},{"$f":"+Parameters!F55","v":5},null,{"$f":"D106/SUM(D106:D109)","v":0.625},{"$f":"E106/SUM(E106:E109)","v":0.78125},{"$f":"F106/SUM(F106:F109)","v":0.44642857142857145},{"$f":"G106/SUM(G106:G109)","v":0.3125},null,null,null,null,null,null,null,null,null,null,null,null,{"$f":"+B106","v":0},{"$f":"AVERAGE(I106:L106)","v":0.54129464285714279},null,{"$f":"MMULT(D106:G109,Z106:Z109)","v":2.8348214285714288},{"$f":"AB106/Z106","v":5.2371134020618566}]
[null,null,{"$f":"+'Definitie Criteria'!$C$16","v":0},{"$f":"+Parameters!C56","v":0.2},{"$f":"+Parameters!D56","v":1},{"$f":"+Parameters!E56","v":5},{"$f":"+Parameters!F56","v":5},null,{"$f":"D107/SUM(D106:D109)","v":0.12500000000000003},{"$f":"E107/SUM(E106:E109)","v":0.15625},{"$f":"F107/SUM(F106:F109)","v":0.44642857142857145},{"$f":"G107/SUM(G106:G109)","v":0.3125},null,null,null,null,null,null,null,null,null,null,null,null,{"$f":"+B107","v":0},{"$f":"AVERAGE(I107:L107)","v":0.26004464285714285},null,1.361607142857143,{"$f":"AB107/Z107","v":5.2360515021459237}]
[null,null,{"$f":"+'Definitie Criteria'!$C$17","v":0},{"$f":"+Parameters!C57","v":0.2},{"$f":"+Parameters!D57","v":0.2},{"$f":"+Parameters!E57","v":1},{"$f":"+Parameters!F57","v":5},null,{"$f":"D108/SUM(D106:D109)","v":0.12500000000000003},{"$f":"E108/SUM(E106:E109)","v":3.125E-2},{"$f":"F108/SUM(F106:F109)","v":8.9285714285714288E-2},{"$f":"G108/SUM(G106:G109)","v":0.3125},null,null,null,null,null,null,null,null,null,null,null,null,{"$f":"+B108","v":0},{"$f":"AVERAGE(I108:L108)","v":0.13950892857142858},null,0.59553571428571428,{"$f":"AB108/Z108","v":4.2687999999999997}]
[null,null,{"$f":"+'Definitie Criteria'!$C$18","v":0},{"$f":"+Parameters!C58","v":0.2},{"$f":"+Parameters!D58","v":0.2},{"$f":"+Parameters!E58","v":0.2},{"$f":"+Parameters!F58","v":1},null,{"$f":"D109/SUM(D106:D109)","v":0.12500000000000003},{"$f":"E109/SUM(E106:E109)","v":3.125E-2},{"$f":"F109/SUM(F106:F109)","v":1.785714285714286E-2},{"$f":"G109/SUM(G106:G109)","v":6.25E-2},null,null,null,null,null,null,null,null,null,null,null,null,{"$f":"+B109","v":0},{"$f":"AVERAGE(I109:L109)","v":5.9151785714285719E-2},null,0.24732142857142858,{"$f":"AB109/Z109","v":4.1811320754716981}]
[null,null,null,null,null,null,null,null,null,null,null,null,null,null,null,null,null,null,null,null,null,null,null,null,null,null,null,"CI=",{"$f":"(AVERAGE(AC106:AC109)-4)/3","v":0.24359141497328984},"CI/RI=",{"$f":"AC110/0.9","v":0.2706571277480998}]
["Matrix 4 Criteria (aangepast)","Optimaal",null,{"$f":"+'Definitie Criteria'!$C$15","v":0},{"$f":"+'Definitie Criteria'!$C$16","v":0},{"$f":"+'Definitie Criteria'!$C$17","v":0},{"$f":"+'Definitie Criteria'!$C$18","v":0},null,null,null,null,null,null,null,null,null,null,null,null,null,null,null,null,"Criterium",null,"%",null,"Product","Ratio"]
[null,{"$f":"+'Definitie Criteria'!$C$15","v":0},{"$f":"+'Definitie Criteria'!$C$15","v":0},{"$f":"+C55","v":1},{"$f":"+D55","v":5},{"$f":"+E55","v":5},{"$f":"+F55","v":5},null,{"$f":"D112/SUM(D112:D115)","v":0.625},{"$f":"E112/SUM(E112:E115)","v":0.625},{"$f":"F112/SUM(F112:F115)","v":0.625},{"$f":"G112/SUM(G112:G115)","v":0.625},null,null,null,null,null,null,null,null,null,null,null,null,{"$f":"+B112","v":0},{"$f":"AVERAGE(I112:L112)","v":0.625},null,{"$f":"MMULT(D112:G115,Z112:Z115)","v":2.5},{"$f":"AB112/Z112","v":4}]
[null,{"$f":"+'Definitie Criteria'!$C$16","v":0},{"$f":"+'Definitie Criteria'!$C$16","v":0},{"$f":"1/E112","v":0.2},1,{"$f":"+F112/E112","v":1},{"$f":"+G112/E112","v":1},null,{"$f":"D113/SUM(D112:D115)","v":0.12500000000000003},{"$f":"E113/SUM(E112:E115)","v":0.125},{"$f":"F113/SUM(F112:F115)","v":0.125},{"$f":"G113/SUM(G112:G115)","v":0.125},null,null,null,null,null,null,null,null,null,null,null,null,{"$f":"+B113","v":0},{"$f":"AVERAGE(I113:L113)","v":0.125},null,0.5,{"$f":"AB113/Z113","v":4}]
[null,{"$f":"+'Definitie Criteria'!$C$17","v":0},{"$f":"+'Definitie Criteria'!$C$17","v":0},{"$f":"1/F112","v":0.2},{"$f":"1/F113","v":1},1,{"$f":"+G113/F113","v":1},null,{"$f":"D114/SUM(D112:D115)","v":0.12500000000000003},{"$f":"E114/SUM(E112:E115)","v":0.125},{"$f":"F114/SUM(F112:F115)","v":0.125},{"$f":"G114/SUM(G112:G115)","v":0.125},null,null,null,null,null,null,null,null,null,null,null,null,{"$f":"+B114","v":0},{"$f":"AVERAGE(I114:L114)","v":0.125},null,0.5,{"$f":"AB114/Z114","v":4}]
[null,{"$f":"+'Definitie Criteria'!$C$18","v":0},{"$f":"+'Definitie Criteria'!$C$18","v":0},{"$f":"1/G112","v":0.2},{"$f":"1/G113","v":1},{"$f":"1/G114","v":1},1,null,{"$f":"D115/SUM(D112:D115)","v":0.12500000000000003},{"$f":"E115/SUM(E112:E115)","v":0.125},{"$f":"F115/SUM(F112:F115)","v":0.125},{"$f":"G115/SUM(G112:G115)","v":0.125},null,null,null,null,null,null,null,null,null,null,null,null,{"$f":"+B115","v":0},{"$f":"AVERAGE(I115:L115)","v":0.125},null,0.5,{"$f":"AB115/Z115","v":4}]
[null,null,null,null,null,null,null,null,null,null,null,null,null,null,null,null,null,null,null,null,null,null,null,null,null,null,null,"CI=",{"$f":"(AVERAGE(AC112:AC115)-4)/3","v":0},"CI/RI=",{"$f":"AC116/0.9","v":0}]
["Analyse 4","Analyse",null,{"$f":"+Parameters!$E$15","v":0},{"$f":"+Parameters!$E$16","v":0},{"$f":"+Parameters!$E$17","v":0},{"$f":"+Parameters!$E$18","v":0}]
[null,null,{"$f":"+Parameters!$E$15","v":0}," ",{"$f":"ABS((E112-E106)/E112)","v":0},{"$f":"ABS((F112-F106)/F112)","v":0},{"$f":"ABS((G112-G106)/G112)","v":0}]
[null,null,{"$f":"+Parameters!$E$16","v":0},null," ",{"$f":"ABS((F113-F107)/F113)","v":4},{"$f":"ABS((G113-G107)/G113)","v":4}]
[null,null,{"$f":"+Parameters!$E$17","v":0},null,null," ",{"$f":"ABS((G114-G108)/G114)","v":4}]
[null,null,{"$f":"+Parameters!$E$18","v":0},null,null,null," "]
[]
[null,null,null,null,null,null,null,null,null,"Genormaliseerde matrix"]
["Matrix 5 Criteria","Matrix",null,{"$f":"+'Definitie Criteria'!$C$15","v":0},{"$f":"+'Definitie Criteria'!$C$16","v":0},{"$f":"+'Definitie Criteria'!$C$17","v":0},{"$f":"+'Definitie Criteria'!$C$18","v":0},{"$f":"+'Definitie Criteria'!$C$19","v":0},null,null,null,null,null,null,null,null,null,null,null,null,null,null,null,"Criterium",null,"%",null,"Product","Ratio"]
[null,null,{"$f":"+'Definitie Criteria'!$C$15","v":0},{"$f":"+Parameters!C55","v":1},{"$f":"+Parameters!D55","v":5},{"$f":"+Parameters!E55","v":5},{"$f":"+Parameters!F55","v":5},{"$f":"+Parameters!G55","v":0},null,{"$f":"D125/SUM(D125:D129)","v":{"$error":"#DIV/0!"}},{"$f":"E125/SUM(E125:E129)","v":{"$error":"#DIV/0!"}},{"$f":"F125/SUM(F125:F129)","v":{"$error":"#DIV/0!"}},{"$f":"G125/SUM(G125:G129)","v":{"$error":"#DIV/0!"}},{"$f":"H125/SUM(H125:H129)","v":0},null,null,null,null,null,null,null,null,null,null,{"$f":"+B125","v":0},{"$f":"AVERAGE(J125:N125)","v":{"$error":"#DIV/0!"}},null,{"$f":"MMULT(D125:H129,Z125:Z129)","v":{"$error":"#DIV/0!"}},{"$f":"AB125/Z125","v":{"$error":"#DIV/0!"}}]
[null,null,{"$f":"+'Definitie Criteria'!$C$16","v":0},{"$f":"+Parameters!C56","v":0.2},{"$f":"+Parameters!D56","v":1},{"$f":"+Parameters!E56","v":5},{"$f":"+Parameters!F56","v":5},{"$f":"+Parameters!G56","v":0},null,{"$f":"D126/SUM(D125:D129)","v":{"$error":"#DIV/0!"}},{"$f":"E126/SUM(E125:E129)","v":{"$error":"#DIV/0!"}},{"$f":"F126/SUM(F125:F129)","v":{"$error":"#DIV/0!"}},{"$f":"G126/SUM(G125:G129)","v":{"$error":"#DIV/0!"}},{"$f":"H126/SUM(H125:H129)","v":0},null,null,null,null,null,null,null,null,null,null,{"$f":"+B126","v":0},{"$f":"AVERAGE(J126:N126)","v":{"$error":"#DIV/0!"}},null,{"$error":"#DIV/0!"},{"$f":"AB126/Z126","v":{"$error":"#DIV/0!"}}]
[null,null,{"$f":"+'Definitie Criteria'!$C$17","v":0},{"$f":"+Parameters!C57","v":0.2},{"$f":"+Parameters!D57","v":0.2},{"$f":"+Parameters!E57","v":1},{"$f":"+Parameters!F57","v":5},{"$f":"+Parameters!G57","v":0},null,{"$f":"D127/SUM(D125:D129)","v":{"$error":"#DIV/0!"}},{"$f":"E127/SUM(E125:E129)","v":{"$error":"#DIV/0!"}},{"$f":"F127/SUM(F125:F129)","v":{"$error":"#DIV/0!"}},{"$f":"G127/SUM(G125:G129)","v":{"$error":"#DIV/0!"}},{"$f":"H127/SUM(H125:H129)","v":0},null,null,null,null,null,null,null,null,null,null,{"$f":"+B127","v":0},{"$f":"AVERAGE(J127:N127)","v":{"$error":"#DIV/0!"}},null,{"$error":"#DIV/0!"},{"$f":"AB127/Z127","v":{"$error":"#DIV/0!"}}]
[null,null,{"$f":"+'Definitie Criteria'!$C$18","v":0},{"$f":"+Parameters!C58","v":0.2},{"$f":"+Parameters!D58","v":0.2},{"$f":"+Parameters!E58","v":0.2},{"$f":"+Parameters!F58","v":1},{"$f":"+Parameters!G58","v":0},null,{"$f":"D128/SUM(D125:D129)","v":{"$error":"#DIV/0!"}},{"$f":"E128/SUM(E125:E129)","v":{"$error":"#DIV/0!"}},{"$f":"F128/SUM(F125:F129)","v":{"$error":"#DIV/0!"}},{"$f":"G128/SUM(G125:G129)","v":{"$error":"#DIV/0!"}},{"$f":"H128/SUM(H125:H129)","v":0},null,null,null,null,null,null,null,null,null,null,{"$f":"+B128","v":0},{"$f":"AVERAGE(J128:N128)","v":{"$error":"#DIV/0!"}},null,{"$error":"#DIV/0!"},{"$f":"AB128/Z128","v":{"$error":"#DIV/0!"}}]
[null,null,{"$f":"+'Definitie Criteria'!$C$19","v":0},{"$f":"+Parameters!C59","v":{"$error":"#DIV/0!"}},{"$f":"+Parameters!D59","v":{"$error":"#DIV/0!"}},{"$f":"+Parameters!E59","v":{"$error":"#DIV/0!"}},{"$f":"+Parameters!F59","v":{"$error":"#DIV/0!"}},{"$f":"+Parameters!G59","v":1},null,{"$f":"D129/SUM(D125:D129)","v":{"$error":"#DIV/0!"}},{"$f":"E129/SUM(E125:E129)","v":{"$error":"#DIV/0!"}},{"$f":"F129/SUM(F125:F129)","v":{"$error":"#DIV/0!"}},{"$f":"G129/SUM(G125:G129)","v":{"$error":"#DIV/0!"}},{"$f":"H129/SUM(H125:H129)","v":1},null,null,null,null,null,null,null,null,null,null,{"$f":"+B129","v":0},{"$f":"AVERAGE(J129:N129)","v":{"$error":"#DIV/0!"}},null,{"$error":"#DIV/0!"},{"$f":"AB129/Z129","v":{"$error":"#DIV/0!"}}]
[null,null,null,null,null,null,null,null,null,null,null,null,null,null,null,null,null,null,null,null,null,null,null,null,null,null,null,"CI=",{"$f":"(AVERAGE(AC125:AC129)-5)/4","v":{"$error":"#DIV/0!"}},"CI/RI=",{"$f":"AC130/1.12","v":{"$error":"#DIV/0!"}}]
["Matrix 5 Criteria (aangepast)","Optimaal",null,{"$f":"+'Definitie Criteria'!$C$15","v":0},{"$f":"+'Definitie Criteria'!$C$16","v":0},{"$f":"+'Definitie Criteria'!$C$17","v":0},{"$f":"+'Definitie Criteria'!$C$18","v":0},{"$f":"+'Definitie Criteria'!$C$19","v":0},null,null,null,null,null,null,null,null,null,null,null,null,null,null,null,"Criterium",null,"%",null,"Product","Ratio"]
[null,{"$f":"+'Definitie Criteria'!$C$15","v":0},{"$f":"+'Definitie Criteria'!$C$15","v":0},{"$f":"+C55","v":1},{"$f":"+D55","v":5},{"$f":"+E55","v":5},{"$f":"+F55","v":5},{"$f":"+G55","v":0},null,{"$f":"D132/SUM(D132:D136)","v":{"$error":"#DIV/0!"}},{"$f":"E132/SUM(E132:E136)","v":{"$error":"#DIV/0!"}},{"$f":"F132/SUM(F132:F136)","v":{"$error":"#DIV/0!"}},{"$f":"G132/SUM(G132:G136)","v":{"$error":"#DIV/0!"}},{"$f":"H132/SUM(H132:H136)","v":0},null,null,null,null,null,null,null,null,null,null,{"$f":"+B132","v":0},{"$f":"AVERAGE(J132:N132)","v":{"$error":"#DIV/0!"}},null,{"$f":"MMULT(D132:H136,Z132:Z136)","v":{"$error":"#DIV/0!"}},{"$f":"AB132/Z132","v":{"$error":"#DIV/0!"}}]
[null,{"$f":"+'Definitie Criteria'!$C$16","v":0},{"$f":"+'Definitie Criteria'!$C$16","v":0},{"$f":"1/E132","v":0.2},1,{"$f":"+F132/E132","v":1},{"$f":"+G132/E132","v":1},{"$f":"+H132/E132","v":0},null,{"$f":"D133/SUM(D132:D136)","v":{"$error":"#DIV/0!"}},{"$f":"E133/SUM(E132:E136)","v":{"$error":"#DIV/0!"}},{"$f":"F133/SUM(F132:F136)","v":{"$error":"#DIV/0!"}},{"$f":"G133/SUM(G132:G136)","v":{"$error":"#DIV/0!"}},{"$f":"H133/SUM(H132:H136)","v":0},null,null,null,null,null,null,null,null,null,null,{"$f":"+B133","v":0},{"$f":"AVERAGE(J133:N133)","v":{"$error":"#DIV/0!"}},null,{"$error":"#DIV/0!"},{"$f":"AB133/Z133","v":{"$error":"#DIV/0!"}}]
[null,{"$f":"+'Definitie Criteria'!$C$17","v":0},{"$f":"+'Definitie Criteria'!$C$17","v":0},{"$f":"1/F132","v":0.2},{"$f":"1/F133","v":1},1,{"$f":"+G133/F133","v":1},{"$f":"+H133/F133","v":0},null,{"$f":"D134/SUM(D132:D136)","v":{"$error":"#DIV/0!"}},{"$f":"E134/SUM(E132:E136)","v":{"$error":"#DIV/0!"}},{"$f":"F134/SUM(F132:F136)","v":{"$error":"#DIV/0!"}},{"$f":"G134/SUM(G132:G136)","v":{"$error":"#DIV/0!"}},{"$f":"H134/SUM(H132:H136)","v":0},null,null,null,null,null,null,null,null,null,null,{"$f":"+B134","v":0},{"$f":"AVERAGE(J134:N134)","v":{"$error":"#DIV/0!"}},null,{"$error":"#DIV/0!"},{"$f":"AB134/Z134","v":{"$error":"#DIV/0!"}}]
[null,{"$f":"+'Definitie Criteria'!$C$18","v":0},{"$f":"+'Definitie Criteria'!$C$18","v":0},{"$f":"1/G132","v":0.2},{"$f":"1/G133","v":1},{"$f":"1/G134","v":1},1,{"$f":"+H134/G134","v":0},null,{"$f":"D135/SUM(D132:D136)","v":{"$error":"#DIV/0!"}},{"$f":"E135/SUM(E132:E136)","v":{"$error":"#DIV/0!"}},{"$f":"F135/SUM(F132:F136)","v":{"$error":"#DIV/0!"}},{"$f":"G135/SUM(G132:G136)","v":{"$error":"#DIV/0!"}},{"$f":"H135/SUM(H132:H136)","v":0},null,null,null,null,null,null,null,null,null,null,{"$f":"+B135","v":0},{"$f":"AVERAGE(J135:N135)","v":{"$error":"#DIV/0!"}},null,{"$error":"#DIV/0!"},{"$f":"AB135/Z135","v":{"$error":"#DIV/0!"}}]
[null,{"$f":"+'Definitie Criteria'!$C$19","v":0},{"$f":"+'Definitie Criteria'!$C$19","v":0},{"$f":"1/H132","v":{"$error":"#DIV/0!"}},{"$f":"1/H133","v":{"$error":"#DIV/0!"}},{"$f":"1/H134","v":{"$error":"#DIV/0!"}},{"$f":"1/H135","v":{"$error":"#DIV/0!"}},1,null,{"$f":"D136/SUM(D132:D136)","v":{"$error":"#DIV/0!"}},{"$f":"E136/SUM(E132:E136)","v":{"$error":"#DIV/0!"}},{"$f":"F136/SUM(F132:F136)","v":{"$error":"#DIV/0!"}},{"$f":"G136/SUM(G132:G136)","v":{"$error":"#DIV/0!"}},{"$f":"H136/SUM(H132:H136)","v":1},null,null,null,null,null,null,null,null,null,null,{"$f":"+B136","v":0},{"$f":"AVERAGE(J136:N136)","v":{"$error":"#DIV/0!"}},null,{"$error":"#DIV/0!"},{"$f":"AB136/Z136","v":{"$error":"#DIV/0!"}}]
[null,null,null,null,null,null,null,null,null,null,null,null,null,null,null,null,null,null,null,null,null,null,null,null,null,null,null,"CI=",{"$f":"(AVERAGE(AC132:AC136)-5)/4","v":{"$error":"#DIV/0!"}},"CI/RI=",{"$f":"AC137/1.12","v":{"$error":"#DIV/0!"}}]
["Analyse 5","Analyse",null,{"$f":"+Parameters!$E$15","v":0},{"$f":"+Parameters!$E$16","v":0},{"$f":"+Parameters!$E$17","v":0},{"$f":"+Parameters!$E$18","v":0},{"$f":"+Parameters!$E$19","v":0}]
[null,null,{"$f":"+Parameters!$E$15","v":0}," ",{"$f":"ABS((E132-E125)/E132)","v":0},{"$f":"ABS((F132-F125)/F132)","v":0},{"$f":"ABS((G132-G125)/G132)","v":0},{"$f":"ABS((H132-H125)/H132)","v":{"$error":"#DIV/0!"}}]
[null,null,{"$f":"+Parameters!$E$16","v":0},null," ",{"$f":"ABS((F133-F126)/F133)","v":4},{"$f":"ABS((G133-G126)/G133)","v":4},{"$f":"ABS((H133-H126)/H133)","v":{"$error":"#DIV/0!"}}]
[null,null,{"$f":"+Parameters!$E$17","v":0},null,null," ",{"$f":"ABS((G134-G127)/G134)","v":4},{"$f":"ABS((H134-H127)/H134)","v":{"$error":"#DIV/0!"}}]
[null,null,{"$f":"+Parameters!$E$18","v":0},null,null,null," ",{"$f":"ABS((H135-H128)/H135)","v":{"$error":"#DIV/0!"}}]
[null,null,{"$f":"+Parameters!$E$19","v":0},null,null,null,null," "]
[]
[]
["Matrix 6 Criteria","Matrix",null,{"$f":"+'Definitie Criteria'!$C$15","v":0},{"$f":"+'Definitie Criteria'!$C$16","v":0},{"$f":"+'Definitie Criteria'!$C$17","v":0},{"$f":"+'Definitie Criteria'!$C$18","v":0},{"$f":"+'Definitie Criteria'!$C$19","v":0},{"$f":"+'Definitie Criteria'!$C$20","v":0},null,null,null,null,null,null,null,null,null,null,null,null,null,null,"Criterium",null,"%",null,"Product","Ratio"]
[null,null,{"$f":"+'Definitie Criteria'!$C$15","v":0},{"$f":"+Parameters!C55","v":1},{"$f":"+Parameters!D55","v":5},{"$f":"+Parameters!E55","v":5},{"$f":"+Parameters!F55","v":5},{"$f":"+Parameters!G55","v":0},{"$f":"+Parameters!H55","v":0},null,{"$f":"D147/SUM(D147:D152)","v":{"$error":"#DIV/0!"}},{"$error":"#DIV/0!"},{"$error":"#DIV/0!"},{"$error":"#DIV/0!"},{"$error":"#DIV/0!"},0,null,null,null,null,null,null,null,null,{"$f":"+B147","v":0},{"$f":"AVERAGE(K147:P147)","v":{"$error":"#DIV/0!"}},null,{"$f":"MMULT(D147:I152,Z147:Z152)","v":{"$error":"#DIV/0!"}},{"$f":"AB147/Z147","v":{"$error":"#DIV/0!"}}]
[null,null,{"$f":"+'Definitie Criteria'!$C$16","v":0},{"$f":"+Parameters!C56","v":0.2},{"$f":"+Parameters!D56","v":1},{"$f":"+Parameters!E56","v":5},{"$f":"+Parameters!F56","v":5},{"$f":"+Parameters!G56","v":0},{"$f":"+Parameters!H56","v":0},null,{"$f":"D148/SUM(D147:D152)","v":{"$error":"#DIV/0!"}},{"$error":"#DIV/0!"},{"$error":"#DIV/0!"},{"$error":"#DIV/0!"},{"$error":"#DIV/0!"},0,null,null,null,null,null,null,null,null,0,{"$error":"#DIV/0!"},null,{"$error":"#DIV/0!"},{"$error":"#DIV/0!"}]
[null,null,{"$f":"+'Definitie Criteria'!$C$17","v":0},{"$f":"+Parameters!C57","v":0.2},{"$f":"+Parameters!D57","v":0.2},{"$f":"+Parameters!E57","v":1},{"$f":"+Parameters!F57","v":5},{"$f":"+Parameters!G57","v":0},{"$f":"+Parameters!H57","v":0},null,{"$f":"D149/SUM(D147:D152)","v":{"$error":"#DIV/0!"}},{"$error":"#DIV/0!"},{"$error":"#DIV/0!"},{"$error":"#DIV/0!"},{"$error":"#DIV/0!"},0,null,null,null,null,null,null,null,null,0,{"$error":"#DIV/0!"},null,{"$error":"#DIV/0!"},{"$error":"#DIV/0!"}]
[null,null,{"$f":"+'Definitie Criteria'!$C$18","v":0},{"$f":"+Parameters!C58","v":0.2},{"$f":"+Parameters!D58","v":0.2},{"$f":"+Parameters!E58","v":0.2},{"$f":"+Parameters!F58","v":1},{"$f":"+Parameters!G58","v":0},{"$f":"+Parameters!H58","v":0},null,{"$f":"D150/SUM(D147:D152)","v":{"$error":"#DIV/0!"}},{"$error":"#DIV/0!"},{"$error":"#DIV/0!"},{"$error":"#DIV/0!"},{"$error":"#DIV/0!"},0,null,null,null,null,null,null,null,null,0,{"$error":"#DIV/0!"},null,{"$error":"#DIV/0!"},{"$error":"#DIV/0!"}]
[null,null,{"$f":"+'Definitie Criteria'!$C$19","v":0},{"$f":"+Parameters!C59","v":{"$error":"#DIV/0!"}},{"$f":"+Parameters!D59","v":{"$error":"#DIV/0!"}},{"$f":"+Parameters!E59","v":{"$error":"#DIV/0!"}},{"$f":"+Parameters!F59","v":{"$error":"#DIV/0!"}},{"$f":"+Parameters!G59","v":1},{"$f":"+Parameters!H59","v":0},null,{"$f":"D151/SUM(D147:D152)","v":{"$error":"#DIV/0!"}},{"$error":"#DIV/0!"},{"$error":"#DIV/0!"},{"$error":"#DIV/0!"},{"$error":"#DIV/0!"},0,null,null,null,null,null,null,null,null,0,{"$error":"#DIV/0!"},null,{"$error":"#DIV/0!"},{"$error":"#DIV/0!"}]
[null,null,{"$f":"+'Definitie Criteria'!$C$20","v":0},{"$f":"+Parameters!C60","v":{"$error":"#DIV/0!"}},{"$f":"+Parameters!D60","v":{"$error":"#DIV/0!"}},{"$f":"+Parameters!E60","v":{"$error":"#DIV/0!"}},{"$f":"+Parameters!F60","v":{"$error":"#DIV/0!"}},{"$f":"+Parameters!G60","v":{"$error":"#DIV/0!"}},{"$f":"+Parameters!H60","v":1},null,{"$f":"D152/SUM(D147:D152)","v":{"$error":"#DIV/0!"}},{"$error":"#DIV/0!"},{"$error":"#DIV/0!"},{"$error":"#DIV/0!"},{"$error":"#DIV/0!"},1,null,null,null,null,null,null,null,null,0,{"$error":"#DIV/0!"},null,{"$error":"#DIV/0!"},{"$error":"#DIV/0!"}]
[null,null,null,null,null,null,null,null,null,null,null,null,null,null,null,null,null,null,null,null,null,null,null,null,null,null,null,"CI=",{"$f":"(AVERAGE(AC147:AC152)-6)/5","v":{"$error":"#DIV/0!"}},"CI/RI=",{"$f":"AC153/1.24","v":{"$error":"#DIV/0!"}}]
["Matrix 6 Criteria (aangepast)","Optimaal",null,{"$f":"+'Definitie Criteria'!$C$15","v":0},{"$f":"+'Definitie Criteria'!$C$16","v":0},{"$f":"+'Definitie Criteria'!$C$17","v":0},{"$f":"+'Definitie Criteria'!$C$18","v":0},{"$f":"+'Definitie Criteria'!$C$19","v":0},{"$f":"+'Definitie Criteria'!$C$20","v":0},null,null,null,null,null,null,null,null,null,null,null,null,null,null,"Criterium",null,"%",null,"Product","Ratio"]
[null,{"$f":"+'Definitie Criteria'!$C$15","v":0},{"$f":"+'Definitie Criteria'!$C$15","v":0},{"$f":"+C55","v":1},5,5,5,0,0,null,{"$f":"D155/SUM(D155:D160)","v":{"$error":"#DIV/0!"}},{"$error":"#DIV/0!"},{"$error":"#DIV/0!"},{"$error":"#DIV/0!"},{"$error":"#DIV/0!"},{"$error":"#DIV/0!"},null,null,null,null,null,null,null,null,{"$f":"+B155","v":0},{"$f":"AVERAGE(K155:P155)","v":{"$error":"#DIV/0!"}},null,{"$f":"MMULT(D155:I160,Z155:Z160)","v":{"$error":"#DIV/0!"}},{"$f":"AB155/Z155","v":{"$error":"#DIV/0!"}}]
[null,{"$f":"+'Definitie Criteria'!$C$16","v":0},{"$f":"+'Definitie Criteria'!$C$16","v":0},{"$f":"1/E155","v":0.2},1,{"$f":"+F155/E155","v":1},{"$f":"+G155/E155","v":1},{"$f":"+H155/E155","v":0},{"$f":"+I155/E155","v":0},null,{"$f":"D156/SUM(D155:D160)","v":{"$error":"#DIV/0!"}},{"$error":"#DIV/0!"},{"$error":"#DIV/0!"},{"$error":"#DIV/0!"},{"$error":"#DIV/0!"},{"$error":"#DIV/0!"},null,null,null,null,null,null,null,null,0,{"$error":"#DIV/0!"},null,{"$error":"#DIV/0!"},{"$error":"#DIV/0!"}]
[null,{"$f":"+'Definitie Criteria'!$C$17","v":0},{"$f":"+'Definitie Criteria'!$C$17","v":0},{"$f":"1/F155","v":0.2},{"$f":"1/F156","v":1},1,{"$f":"+G156/F156","v":1},{"$f":"+H156/F156","v":0},{"$f":"+I156/F156","v":0},null,{"$f":"D157/SUM(D155:D160)","v":{"$error":"#DIV/0!"}},{"$error":"#DIV/0!"},{"$error":"#DIV/0!"},{"$error":"#DIV/0!"},{"$error":"#DIV/0!"},{"$error":"#DIV/0!"},null,null,null,null,null,null,null,null,0,{"$error":"#DIV/0!"},null,{"$error":"#DIV/0!"},{"$error":"#DIV/0!"}]
[null,{"$f":"+'Definitie Criteria'!$C$18","v":0},{"$f":"+'Definitie Criteria'!$C$18","v":0},{"$f":"1/G155","v":0.2},{"$f":"1/G156","v":1},{"$f":"1/G157","v":1},1,{"$f":"+H157/G157","v":0},{"$f":"+I157/G157","v":0},null,{"$f":"D158/SUM(D155:D160)","v":{"$error":"#DIV/0!"}},{"$error":"#DIV/0!"},{"$error":"#DIV/0!"},{"$error":"#DIV/0!"},{"$error":"#DIV/0!"},{"$error":"#DIV/0!"},null,null,null,null,null,null,null,null,0,{"$error":"#DIV/0!"},null,{"$error":"#DIV/0!"},{"$error":"#DIV/0!"}]
[null,{"$f":"+'Definitie Criteria'!$C$19","v":0},{"$f":"+'Definitie Criteria'!$C$19","v":0},{"$f":"1/H155","v":{"$error":"#DIV/0!"}},{"$f":"1/H156","v":{"$error":"#DIV/0!"}},{"$f":"1/H157","v":{"$error":"#DIV/0!"}},{"$f":"1/H158","v":{"$error":"#DIV/0!"}},1,{"$f":"+I158/H158","v":{"$error":"#DIV/0!"}},null,{"$f":"D159/SUM(D155:D160)","v":{"$error":"#DIV/0!"}},{"$error":"#DIV/0!"},{"$error":"#DIV/0!"},{"$error":"#DIV/0!"},{"$error":"#DIV/0!"},{"$error":"#DIV/0!"},null,null,null,null,null,null,null,null,0,{"$error":"#DIV/0!"},null,{"$error":"#DIV/0!"},{"$error":"#DIV/0!"}]
[null,{"$f":"+'Definitie Criteria'!$C$20","v":0},{"$f":"+'Definitie Criteria'!$C$20","v":0},{"$f":"1/I155","v":{"$error":"#DIV/0!"}},{"$f":"1/I156","v":{"$error":"#DIV/0!"}},{"$f":"1/I157","v":{"$error":"#DIV/0!"}},{"$f":"1/I158","v":{"$error":"#DIV/0!"}},{"$f":"1/I159","v":{"$error":"#DIV/0!"}},1,null,{"$f":"D160/SUM(D155:D160)","v":{"$error":"#DIV/0!"}},{"$error":"#DIV/0!"},{"$error":"#DIV/0!"},{"$error":"#DIV/0!"},{"$error":"#DIV/0!"},{"$error":"#DIV/0!"},null,null,null,null,null,null,null,null,0,{"$error":"#DIV/0!"},null,{"$error":"#DIV/0!"},{"$error":"#DIV/0!"}]
[null,null,null,null,null,null,null,null,null,null,null,null,null,null,null,null,null,null,null,null,null,null,null,null,null,null,null,"CI=",{"$f":"(AVERAGE(AC155:AC160)-6)/5","v":{"$error":"#DIV/0!"}},"CI/RI=",{"$f":"AC161/1.24","v":{"$error":"#DIV/0!"}}]
["Analyse 6","Analyse",null,{"$f":"+Parameters!$E$15","v":0},{"$f":"+Parameters!$E$16","v":0},{"$f":"+Parameters!$E$17","v":0},{"$f":"+Parameters!$E$18","v":0},{"$f":"+Parameters!$E$19","v":0},{"$f":"+Parameters!$E$20","v":0}]
[null,null,{"$f":"+Parameters!$E$15","v":0}," ",{"$f":"ABS((E155-E147)/E155)","v":0},{"$f":"ABS((F155-F147)/F155)","v":0},{"$f":"ABS((G155-G147)/G155)","v":0},{"$f":"ABS((H155-H147)/H155)","v":{"$error":"#DIV/0!"}},{"$f":"ABS((I155-I147)/I155)","v":{"$error":"#DIV/0!"}}]
[null,null,{"$f":"+Parameters!$E$16","v":0},null," ",{"$f":"ABS((F156-F148)/F156)","v":4},{"$f":"ABS((G156-G148)/G156)","v":4},{"$f":"ABS((H156-H148)/H156)","v":{"$error":"#DIV/0!"}},{"$f":"ABS((I156-I148)/I156)","v":{"$error":"#DIV/0!"}}]
[null,null,{"$f":"+Parameters!$E$17","v":0},null,null," ",{"$f":"ABS((G157-G149)/G157)","v":4},{"$f":"ABS((H157-H149)/H157)","v":{"$error":"#DIV/0!"}},{"$f":"ABS((I157-I149)/I157)","v":{"$error":"#DIV/0!"}}]
[null,null,{"$f":"+Parameters!$E$18","v":0},null,null,null," ",{"$f":"ABS((H158-H150)/H158)","v":{"$error":"#DIV/0!"}},{"$f":"ABS((I158-I150)/I158)","v":{"$error":"#DIV/0!"}}]
[null,null,{"$f":"+Parameters!$E$19","v":0},null,null,null,null," ",{"$f":"ABS((I159-I151)/I159)","v":{"$error":"#DIV/0!"}}]
[null,null,{"$f":"+Parameters!$E$20","v":0},null,null,null,null,null," "]
[]
[]
["Matrix 7 Criteria","Matrix",null,{"$f":"+'Definitie Criteria'!$C$15","v":0},{"$f":"+'Definitie Criteria'!$C$16","v":0},{"$f":"+'Definitie Criteria'!$C$17","v":0},{"$f":"+'Definitie Criteria'!$C$18","v":0},{"$f":"+'Definitie Criteria'!$C$19","v":0},{"$f":"+'Definitie Criteria'!$C$20","v":0},{"$f":"+'Definitie Criteria'!$C$21","v":0},null,null,null,null,null,null,null,null,null,null,null,null,null,"Criterium",null,"%",null,"Product","Ratio"]
[null,null,{"$f":"+'Definitie Criteria'!$C$15","v":0},{"$f":"+Parameters!C55","v":1},{"$f":"+Parameters!D55","v":5},{"$f":"+Parameters!E55","v":5},{"$f":"+Parameters!F55","v":5},{"$f":"+Parameters!G55","v":0},{"$f":"+Parameters!H55","v":0},{"$f":"+Parameters!I55","v":0},null,{"$f":"D172/SUM(D172:D178)","v":{"$error":"#DIV/0!"}},{"$error":"#DIV/0!"},{"$error":"#DIV/0!"},{"$error":"#DIV/0!"},{"$error":"#DIV/0!"},{"$error":"#DIV/0!"},0,null,null,null,null,null,null,{"$f":"+B172","v":0},{"$f":"AVERAGE(L172:R172)","v":{"$error":"#DIV/0!"}},null,{"$f":"MMULT(D172:J178,Z172:Z178)","v":{"$error":"#DIV/0!"}},{"$f":"AB172/Z172","v":{"$error":"#DIV/0!"}}]
[null,null,{"$f":"+'Definitie Criteria'!$C$16","v":0},{"$f":"+Parameters!C56","v":0.2},{"$f":"+Parameters!D56","v":1},{"$f":"+Parameters!E56","v":5},{"$f":"+Parameters!F56","v":5},{"$f":"+Parameters!G56","v":0},{"$f":"+Parameters!H56","v":0},{"$f":"+Parameters!I56","v":0},null,{"$f":"D173/SUM(D172:D178)","v":{"$error":"#DIV/0!"}},{"$error":"#DIV/0!"},{"$error":"#DIV/0!"},{"$error":"#DIV/0!"},{"$error":"#DIV/0!"},{"$error":"#DIV/0!"},0,null,null,null,null,null,null,0,{"$error":"#DIV/0!"},null,{"$error":"#DIV/0!"},{"$error":"#DIV/0!"}]
[null,null,{"$f":"+'Definitie Criteria'!$C$17","v":0},{"$f":"+Parameters!C57","v":0.2},{"$f":"+Parameters!D57","v":0.2},{"$f":"+Parameters!E57","v":1},{"$f":"+Parameters!F57","v":5},{"$f":"+Parameters!G57","v":0},{"$f":"+Parameters!H57","v":0},{"$f":"+Parameters!I57","v":0},null,{"$f":"D174/SUM(D172:D178)","v":{"$error":"#DIV/0!"}},{"$error":"#DIV/0!"},{"$error":"#DIV/0!"},{"$error":"#DIV/0!"},{"$error":"#DIV/0!"},{"$error":"#DIV/0!"},0,null,null,null,null,null,null,0,{"$error":"#DIV/0!"},null,{"$error":"#DIV/0!"},{"$error":"#DIV/0!"}]
[null,null,{"$f":"+'Definitie Criteria'!$C$18","v":0},{"$f":"+Parameters!C58","v":0.2},{"$f":"+Parameters!D58","v":0.2},{"$f":"+Parameters!E58","v":0.2},{"$f":"+Parameters!F58","v":1},{"$f":"+Parameters!G58","v":0},{"$f":"+Parameters!H58","v":0},{"$f":"+Parameters!I58","v":0},null,{"$f":"D175/SUM(D172:D178)","v":{"$error":"#DIV/0!"}},{"$error":"#DIV/0!"},{"$error":"#DIV/0!"},{"$error":"#DIV/0!"},{"$error":"#DIV/0!"},{"$error":"#DIV/0!"},0,null,null,null,null,null,null,0,{"$error":"#DIV/0!"},null,{"$error":"#DIV/0!"},{"$error":"#DIV/0!"}]
[null,null,{"$f":"+'Definitie Criteria'!$C$19","v":0},{"$f":"+Parameters!C59","v":{"$error":"#DIV/0!"}},{"$f":"+Parameters!D59","v":{"$error":"#DIV/0!"}},{"$f":"+Parameters!E59","v":{"$error":"#DIV/0!"}},{"$f":"+Parameters!F59","v":{"$error":"#DIV/0!"}},{"$f":"+Parameters!G59","v":1},{"$f":"+Parameters!H59","v":0},{"$f":"+Parameters!I59","v":0},null,{"$f":"D176/SUM(D172:D178)","v":{"$error":"#DIV/0!"}},{"$error":"#DIV/0!"},{"$error":"#DIV/0!"},{"$error":"#DIV/0!"},{"$error":"#DIV/0!"},{"$error":"#DIV/0!"},0,null,null,null,null,null,null,0,{"$error":"#DIV/0!"},null,{"$error":"#DIV/0!"},{"$error":"#DIV/0!"}]
[null,null,{"$f":"+'Definitie Criteria'!$C$20","v":0},{"$f":"+Parameters!C60","v":{"$error":"#DIV/0!"}},{"$f":"+Parameters!D60","v":{"$error":"#DIV/0!"}},{"$f":"+Parameters!E60","v":{"$error":"#DIV/0!"}},{"$f":"+Parameters!F60","v":{"$error":"#DIV/0!"}},{"$f":"+Parameters!G60","v":{"$error":"#DIV/0!"}},{"$f":"+Parameters!H60","v":1},{"$f":"+Parameters!I60","v":0},null,{"$f":"D177/SUM(D172:D178)","v":{"$error":"#DIV/0!"}},{"$error":"#DIV/0!"},{"$error":"#DIV/0!"},{"$error":"#DIV/0!"},{"$error":"#DIV/0!"},{"$error":"#DIV/0!"},0,null,null,null,null,null,null,0,{"$error":"#DIV/0!"},null,{"$error":"#DIV/0!"},{"$error":"#DIV/0!"}]
[null,null,{"$f":"+'Definitie Criteria'!$C$21","v":0},{"$f":"+Parameters!C61","v":{"$error":"#DIV/0!"}},{"$f":"+Parameters!D61","v":{"$error":"#DIV/0!"}},{"$f":"+Parameters!E61","v":{"$error":"#DIV/0!"}},{"$f":"+Parameters!F61","v":{"$error":"#DIV/0!"}},{"$f":"+Parameters!G61","v":{"$error":"#DIV/0!"}},{"$f":"+Parameters!H61","v":{"$error":"#DIV/0!"}},{"$f":"+Parameters!I61","v":1},null,{"$f":"D178/SUM(D172:D178)","v":{"$error":"#DIV/0!"}},{"$error":"#DIV/0!"},{"$error":"#DIV/0!"},{"$error":"#DIV/0!"},{"$error":"#DIV/0!"},{"$error":"#DIV/0!"},1,null,null,null,null,null,null,0,{"$error":"#DIV/0!"},null,{"$error":"#DIV/0!"},{"$error":"#DIV/0!"}]
[null,null,null,null,null,null,null,null,null,null,null,null,null,null,null,null,null,null,null,null,null,null,null,null,null,null,null,"CI=",{"$f":"(AVERAGE(AC172:AC178)-7)/6","v":{"$error":"#DIV/0!"}},"CI/RI=",{"$f":"AC179/1.32","v":{"$error":"#DIV/0!"}}]
["Matrix 7 Criteria (aangepast)","Optimaal",null,{"$f":"+'Definitie Criteria'!$C$15","v":0},{"$f":"+'Definitie Criteria'!$C$16","v":0},{"$f":"+'Definitie Criteria'!$C$17","v":0},{"$f":"+'Definitie Criteria'!$C$18","v":0},{"$f":"+'Definitie Criteria'!$C$19","v":0},{"$f":"+'Definitie Criteria'!$C$20","v":0},{"$f":"+'Definitie Criteria'!$C$21","v":0},null,null,null,null,null,null,null,null,null,null,null,null,null,"Criterium",null,"%",null,"Product","Ratio"]
[null,{"$f":"+'Definitie Criteria'!$C$15","v":0},{"$f":"+'Definitie Criteria'!$C$15","v":0},{"$f":"+C55","v":1},5,5,5,0,0,0,null,{"$f":"D181/SUM(D181:D187)","v":{"$error":"#DIV/0!"}},{"$error":"#DIV/0!"},{"$error":"#DIV/0!"},{"$error":"#DIV/0!"},{"$error":"#DIV/0!"},{"$error":"#DIV/0!"},{"$error":"#DIV/0!"},null,null,null,null,null,null,{"$f":"+B181","v":0},{"$f":"AVERAGE(L181:R181)","v":{"$error":"#DIV/0!"}},null,{"$f":"MMULT(D181:J187,Z181:Z187)","v":{"$error":"#DIV/0!"}},{"$f":"AB181/Z181","v":{"$error":"#DIV/0!"}}]
[null,{"$f":"+'Definitie Criteria'!$C$16","v":0},{"$f":"+'Definitie Criteria'!$C$16","v":0},{"$f":"1/E181","v":0.2},1,{"$f":"+F181/E181","v":1},{"$f":"+G181/E181","v":1},{"$f":"+H181/E181","v":0},{"$f":"+I181/E181","v":0},{"$f":"+J181/E181","v":0},null,{"$f":"D182/SUM(D181:D187)","v":{"$error":"#DIV/0!"}},{"$error":"#DIV/0!"},{"$error":"#DIV/0!"},{"$error":"#DIV/0!"},{"$error":"#DIV/0!"},{"$error":"#DIV/0!"},{"$error":"#DIV/0!"},null,null,null,null,null,null,0,{"$error":"#DIV/0!"},null,{"$error":"#DIV/0!"},{"$error":"#DIV/0!"}]
[null,{"$f":"+'Definitie Criteria'!$C$17","v":0},{"$f":"+'Definitie Criteria'!$C$17","v":0},{"$f":"1/F181","v":0.2},{"$f":"1/F182","v":1},1,{"$f":"+G182/F182","v":1},{"$f":"+H182/F182","v":0},{"$f":"+I182/F182","v":0},{"$f":"+J182/F182","v":0},null,{"$f":"D183/SUM(D181:D187)","v":{"$error":"#DIV/0!"}},{"$error":"#DIV/0!"},{"$error":"#DIV/0!"},{"$error":"#DIV/0!"},{"$error":"#DIV/0!"},{"$error":"#DIV/0!"},{"$error":"#DIV/0!"},null,null,null,null,null,null,0,{"$error":"#DIV/0!"},null,{"$error":"#DIV/0!"},{"$error":"#DIV/0!"}]
[null,{"$f":"+'Definitie Criteria'!$C$18","v":0},{"$f":"+'Definitie Criteria'!$C$18","v":0},{"$f":"1/G181","v":0.2},{"$f":"1/G182","v":1},{"$f":"1/G183","v":1},1,{"$f":"+H183/G183","v":0},{"$f":"+I183/G183","v":0},{"$f":"+J183/G183","v":0},null,{"$f":"D184/SUM(D181:D187)","v":{"$error":"#DIV/0!"}},{"$error":"#DIV/0!"},{"$error":"#DIV/0!"},{"$error":"#DIV/0!"},{"$error":"#DIV/0!"},{"$error":"#DIV/0!"},{"$error":"#DIV/0!"},null,null,null,null,null,null,0,{"$error":"#DIV/0!"},null,{"$error":"#DIV/0!"},{"$error":"#DIV/0!"}]
[null,{"$f":"+'Definitie Criteria'!$C$19","v":0},{"$f":"+'Definitie Criteria'!$C$19","v":0},{"$f":"1/H181","v":{"$error":"#DIV/0!"}},{"$f":"1/H182","v":{"$error":"#DIV/0!"}},{"$f":"1/H183","v":{"$error":"#DIV/0!"}},{"$f":"1/H184","v":{"$error":"#DIV/0!"}},1,{"$f":"+I184/H184","v":{"$error":"#DIV/0!"}},{"$f":"+J184/H184","v":{"$error":"#DIV/0!"}},null,{"$f":"D185/SUM(D181:D187)","v":{"$error":"#DIV/0!"}},{"$error":"#DIV/0!"},{"$error":"#DIV/0!"},{"$error":"#DIV/0!"},{"$error":"#DIV/0!"},{"$error":"#DIV/0!"},{"$error":"#DIV/0!"},null,null,null,null,null,null,0,{"$error":"#DIV/0!"},null,{"$error":"#DIV/0!"},{"$error":"#DIV/0!"}]
[null,{"$f":"+'Definitie Criteria'!$C$20","v":0},{"$f":"+'Definitie Criteria'!$C$20","v":0},{"$f":"1/I181","v":{"$error":"#DIV/0!"}},{"$f":"1/I182","v":{"$error":"#DIV/0!"}},{"$f":"1/I183","v":{"$error":"#DIV/0!"}},{"$f":"1/I184","v":{"$error":"#DIV/0!"}},{"$f":"1/I185","v":{"$error":"#DIV/0!"}},1,{"$f":"+J185/I185","v":{"$error":"#DIV/0!"}},null,{"$f":"D186/SUM(D181:D187)","v":{"$error":"#DIV/0!"}},{"$error":"#DIV/0!"},{"$error":"#DIV/0!"},{"$error":"#DIV/0!"},{"$error":"#DIV/0!"},{"$error":"#DIV/0!"},{"$error":"#DIV/0!"},null,null,null,null,null,null,0,{"$error":"#DIV/0!"},null,{"$error":"#DIV/0!"},{"$error":"#DIV/0!"}]
[null,{"$f":"+'Definitie Criteria'!$C$21","v":0},{"$f":"+'Definitie Criteria'!$C$21","v":0},{"$f":"1/J181","v":{"$error":"#DIV/0!"}},{"$f":"1/J182","v":{"$error":"#DIV/0!"}},{"$f":"1/J183","v":{"$error":"#DIV/0!"}},{"$f":"1/J184","v":{"$error":"#DIV/0!"}},{"$f":"1/J185","v":{"$error":"#DIV/0!"}},{"$f":"1/J186","v":{"$error":"#DIV/0!"}},1,null,{"$f":"D187/SUM(D181:D187)","v":{"$error":"#DIV/0!"}},{"$error":"#DIV/0!"},{"$error":"#DIV/0!"},{"$error":"#DIV/0!"},{"$error":"#DIV/0!"},{"$error":"#DIV/0!"},{"$error":"#DIV/0!"},null,null,null,null,null,null,0,{"$error":"#DIV/0!"},null,{"$error":"#DIV/0!"},{"$error":"#DIV/0!"}]
[null,null,null,null,null,null,null,null,null,null,null,null,null,null,null,null,null,null,null,null,null,null,null,null,null,null,null,"CI=",{"$f":"(AVERAGE(AC181:AC187)-7)/6","v":{"$error":"#DIV/0!"}},"CI/RI=",{"$f":"AC188/1.32","v":{"$error":"#DIV/0!"}}]
["Analyse 7","Analyse",null,{"$f":"+Parameters!$E$15","v":0},{"$f":"+Parameters!$E$16","v":0},{"$f":"+Parameters!$E$17","v":0},{"$f":"+Parameters!$E$18","v":0},{"$f":"+Parameters!$E$19","v":0},{"$f":"+Parameters!$E$20","v":0},{"$f":"+Parameters!$E$21","v":0}]
[null,null,{"$f":"+Parameters!$E$15","v":0}," ",{"$f":"ABS((E181-E172)/E181)","v":0},0,0,{"$error":"#DIV/0!"},{"$error":"#DIV/0!"},{"$error":"#DIV/0!"}]
[null,null,{"$f":"+Parameters!$E$16","v":0},null," ",{"$f":"ABS((F182-F173)/F182)","v":4},{"$f":"ABS((G182-G173)/G182)","v":4},{"$f":"ABS((H182-H173)/H182)","v":{"$error":"#DIV/0!"}},{"$f":"ABS((I182-I173)/I182)","v":{"$error":"#DIV/0!"}},{"$f":"ABS((J182-J173)/J182)","v":{"$error":"#DIV/0!"}}]
[null,null,{"$f":"+Parameters!$E$17","v":0},null,null," ",{"$f":"ABS((G183-G174)/G183)","v":4},{"$f":"ABS((H183-H174)/H183)","v":{"$error":"#DIV/0!"}},{"$f":"ABS((I183-I174)/I183)","v":{"$error":"#DIV/0!"}},{"$f":"ABS((J183-J174)/J183)","v":{"$error":"#DIV/0!"}}]
[null,null,{"$f":"+Parameters!$E$18","v":0},null,null,null," ",{"$f":"ABS((H184-H175)/H184)","v":{"$error":"#DIV/0!"}},{"$f":"ABS((I184-I175)/I184)","v":{"$error":"#DIV/0!"}},{"$f":"ABS((J184-J175)/J184)","v":{"$error":"#DIV/0!"}}]
[null,null,{"$f":"+Parameters!$E$19","v":0},null,null,null,null," ",{"$f":"ABS((I185-I176)/I185)","v":{"$error":"#DIV/0!"}},{"$f":"ABS((J185-J176)/J185)","v":{"$error":"#DIV/0!"}}]
[null,null,{"$f":"+Parameters!$E$20","v":0},null,null,null,null,null," ",{"$f":"ABS((J186-J177)/J186)","v":{"$error":"#DIV/0!"}}]
[null,null,{"$f":"+Parameters!$E$21","v":0},null,null,null,null,null,null," "]
[]
[]
["Matrix 8 Criteria","Matrix",null,{"$f":"+'Definitie Criteria'!$C$15","v":0},{"$f":"+'Definitie Criteria'!$C$16","v":0},{"$f":"+'Definitie Criteria'!$C$17","v":0},{"$f":"+'Definitie Criteria'!$C$18","v":0},{"$f":"+'Definitie Criteria'!$C$19","v":0},{"$f":"+'Definitie Criteria'!$C$20","v":0},{"$f":"+'Definitie Criteria'!$C$21","v":0},{"$f":"+'Definitie Criteria'!$C$22","v":0},null,null,null,null,null,null,null,null,null,null,null,null,"Criterium",null,"%",null,"Product","Ratio"]
[null,null,{"$f":"+'Definitie Criteria'!$C$15","v":0},{"$f":"+Parameters!C55","v":1},{"$f":"+Parameters!D55","v":5},{"$f":"+Parameters!E55","v":5},{"$f":"+Parameters!F55","v":5},{"$f":"+Parameters!G55","v":0},{"$f":"+Parameters!H55","v":0},{"$f":"+Parameters!I55","v":0},{"$f":"+Parameters!J55","v":0},null,{"$f":"D200/SUM(D200:D207)","v":{"$error":"#DIV/0!"}},{"$error":"#DIV/0!"},{"$error":"#DIV/0!"},{"$error":"#DIV/0!"},{"$error":"#DIV/0!"},{"$error":"#DIV/0!"},{"$error":"#DIV/0!"},0,null,null,null,null,{"$f":"+B200","v":0},{"$f":"AVERAGE(M200:T200)","v":{"$error":"#DIV/0!"}},null,{"$f":"MMULT(D200:K207,Z200:Z207)","v":{"$error":"#DIV/0!"}},{"$f":"AB200/Z200","v":{"$error":"#DIV/0!"}}]
[null,null,{"$f":"+'Definitie Criteria'!$C$16","v":0},{"$f":"+Parameters!C56","v":0.2},{"$f":"+Parameters!D56","v":1},{"$f":"+Parameters!E56","v":5},{"$f":"+Parameters!F56","v":5},{"$f":"+Parameters!G56","v":0},{"$f":"+Parameters!H56","v":0},{"$f":"+Parameters!I56","v":0},{"$f":"+Parameters!J56","v":0},null,{"$f":"D201/SUM(D200:D207)","v":{"$error":"#DIV/0!"}},{"$error":"#DIV/0!"},{"$error":"#DIV/0!"},{"$error":"#DIV/0!"},{"$error":"#DIV/0!"},{"$error":"#DIV/0!"},{"$error":"#DIV/0!"},0,null,null,null,null,0,{"$f":"AVERAGE(M201:T201)","v":{"$error":"#DIV/0!"}},null,{"$error":"#DIV/0!"},{"$f":"AB201/Z201","v":{"$error":"#DIV/0!"}}]
[null,null,{"$f":"+'Definitie Criteria'!$C$17","v":0},{"$f":"+Parameters!C57","v":0.2},{"$f":"+Parameters!D57","v":0.2},{"$f":"+Parameters!E57","v":1},{"$f":"+Parameters!F57","v":5},{"$f":"+Parameters!G57","v":0},{"$f":"+Parameters!H57","v":0},{"$f":"+Parameters!I57","v":0},{"$f":"+Parameters!J57","v":0},null,{"$f":"D202/SUM(D200:D207)","v":{"$error":"#DIV/0!"}},{"$error":"#DIV/0!"},{"$error":"#DIV/0!"},{"$error":"#DIV/0!"},{"$error":"#DIV/0!"},{"$error":"#DIV/0!"},{"$error":"#DIV/0!"},0,null,null,null,null,0,{"$error":"#DIV/0!"},null,{"$error":"#DIV/0!"},{"$error":"#DIV/0!"}]
[null,null,{"$f":"+'Definitie Criteria'!$C$18","v":0},{"$f":"+Parameters!C58","v":0.2},{"$f":"+Parameters!D58","v":0.2},{"$f":"+Parameters!E58","v":0.2},{"$f":"+Parameters!F58","v":1},{"$f":"+Parameters!G58","v":0},{"$f":"+Parameters!H58","v":0},{"$f":"+Parameters!I58","v":0},{"$f":"+Parameters!J58","v":0},null,{"$f":"D203/SUM(D200:D207)","v":{"$error":"#DIV/0!"}},{"$error":"#DIV/0!"},{"$error":"#DIV/0!"},{"$error":"#DIV/0!"},{"$error":"#DIV/0!"},{"$error":"#DIV/0!"},{"$error":"#DIV/0!"},0,null,null,null,null,0,{"$error":"#DIV/0!"},null,{"$error":"#DIV/0!"},{"$error":"#DIV/0!"}]
[null,null,{"$f":"+'Definitie Criteria'!$C$19","v":0},{"$f":"+Parameters!C59","v":{"$error":"#DIV/0!"}},{"$f":"+Parameters!D59","v":{"$error":"#DIV/0!"}},{"$f":"+Parameters!E59","v":{"$error":"#DIV/0!"}},{"$f":"+Parameters!F59","v":{"$error":"#DIV/0!"}},{"$f":"+Parameters!G59","v":1},{"$f":"+Parameters!H59","v":0},{"$f":"+Parameters!I59","v":0},{"$f":"+Parameters!J59","v":0},null,{"$f":"D204/SUM(D200:D207)","v":{"$error":"#DIV/0!"}},{"$error":"#DIV/0!"},{"$error":"#DIV/0!"},{"$error":"#DIV/0!"},{"$error":"#DIV/0!"},{"$error":"#DIV/0!"},{"$error":"#DIV/0!"},0,null,null,null,null,0,{"$error":"#DIV/0!"},null,{"$error":"#DIV/0!"},{"$error":"#DIV/0!"}]
[null,null,{"$f":"+'Definitie Criteria'!$C$20","v":0},{"$f":"+Parameters!C60","v":{"$error":"#DIV/0!"}},{"$f":"+Parameters!D60","v":{"$error":"#DIV/0!"}},{"$f":"+Parameters!E60","v":{"$error":"#DIV/0!"}},{"$f":"+Parameters!F60","v":{"$error":"#DIV/0!"}},{"$f":"+Parameters!G60","v":{"$error":"#DIV/0!"}},{"$f":"+Parameters!H60","v":1},{"$f":"+Parameters!I60","v":0},{"$f":"+Parameters!J60","v":0},null,{"$f":"D205/SUM(D200:D207)","v":{"$error":"#DIV/0!"}},{"$error":"#DIV/0!"},{"$error":"#DIV/0!"},{"$error":"#DIV/0!"},{"$error":"#DIV/0!"},{"$error":"#DIV/0!"},{"$error":"#DIV/0!"},0,null,null,null,null,0,{"$error":"#DIV/0!"},null,{"$error":"#DIV/0!"},{"$error":"#DIV/0!"}]
[null,null,{"$f":"+'Definitie Criteria'!$C$21","v":0},{"$f":"+Parameters!C61","v":{"$error":"#DIV/0!"}},{"$f":"+Parameters!D61","v":{"$error":"#DIV/0!"}},{"$f":"+Parameters!E61","v":{"$error":"#DIV/0!"}},{"$f":"+Parameters!F61","v":{"$error":"#DIV/0!"}},{"$f":"+Parameters!G61","v":{"$error":"#DIV/0!"}},{"$f":"+Parameters!H61","v":{"$error":"#DIV/0!"}},{"$f":"+Parameters!I61","v":1},{"$f":"+Parameters!J61","v":0},null,{"$f":"D206/SUM(D200:D207)","v":{"$error":"#DIV/0!"}},{"$error":"#DIV/0!"},{"$error":"#DIV/0!"},{"$error":"#DIV/0!"},{"$error":"#DIV/0!"},{"$error":"#DIV/0!"},{"$error":"#DIV/0!"},0,null,null,null,null,0,{"$error":"#DIV/0!"},null,{"$error":"#DIV/0!"},{"$error":"#DIV/0!"}]
[null,null,{"$f":"+'Definitie Criteria'!$C$22","v":0},{"$f":"+Parameters!C62","v":{"$error":"#DIV/0!"}},{"$f":"+Parameters!D62","v":{"$error":"#DIV/0!"}},{"$f":"+Parameters!E62","v":{"$error":"#DIV/0!"}},{"$f":"+Parameters!F62","v":{"$error":"#DIV/0!"}},{"$f":"+Parameters!G62","v":{"$error":"#DIV/0!"}},{"$f":"+Parameters!H62","v":{"$error":"#DIV/0!"}},{"$f":"+Parameters!I62","v":{"$error":"#DIV/0!"}},{"$f":"+Parameters!J62","v":1},null,{"$f":"D207/SUM(D200:D207)","v":{"$error":"#DIV/0!"}},{"$error":"#DIV/0!"},{"$error":"#DIV/0!"},{"$error":"#DIV/0!"},{"$error":"#DIV/0!"},{"$error":"#DIV/0!"},{"$error":"#DIV/0!"},1,null,null,null,null,0,{"$error":"#DIV/0!"},null,{"$error":"#DIV/0!"},{"$error":"#DIV/0!"}]
[null,null,null,null,null,null,null,null,null,null,null,null,null,null,null,null,null,null,null,null,null,null,null,null,null,null,null,"CI=",{"$f":"(AVERAGE(AC200:AC207)-8)/7","v":{"$error":"#DIV/0!"}},"CI/RI=",{"$f":"AC208/1.41","v":{"$error":"#DIV/0!"}}]
["Matrix 8 Criteria (aangepast)","Optimaal",null,{"$f":"+'Definitie Criteria'!$C$15","v":0},{"$f":"+'Definitie Criteria'!$C$16","v":0},{"$f":"+'Definitie Criteria'!$C$17","v":0},{"$f":"+'Definitie Criteria'!$C$18","v":0},{"$f":"+'Definitie Criteria'!$C$19","v":0},{"$f":"+'Definitie Criteria'!$C$20","v":0},{"$f":"+'Definitie Criteria'!$C$21","v":0},{"$f":"+'Definitie Criteria'!$C$22","v":0},null,null,null,null,null,null,null,null,null,null,null,null,"Criterium",null,"%",null,"Product","Ratio"]
[null,{"$f":"+'Definitie Criteria'!$C$15","v":0},{"$f":"+'Definitie Criteria'!$C$15","v":0},{"$f":"+C55","v":1},5,5,5,0,0,0,0,null,{"$f":"D210/SUM(D210:D217)","v":{"$error":"#DIV/0!"}},{"$error":"#DIV/0!"},{"$error":"#DIV/0!"},{"$error":"#DIV/0!"},{"$error":"#DIV/0!"},{"$error":"#DIV/0!"},{"$error":"#DIV/0!"},{"$error":"#DIV/0!"},null,null,null,null,{"$f":"+B210","v":0},{"$f":"AVERAGE(M210:T210)","v":{"$error":"#DIV/0!"}},null,{"$f":"MMULT(D210:K217,Z210:Z217)","v":{"$error":"#DIV/0!"}},{"$f":"AB210/Z210","v":{"$error":"#DIV/0!"}}]
[null,{"$f":"+'Definitie Criteria'!$C$16","v":0},{"$f":"+'Definitie Criteria'!$C$16","v":0},{"$f":"1/E210","v":0.2},1,{"$f":"+F210/E210","v":1},{"$f":"+G210/E210","v":1},{"$f":"+H210/E210","v":0},{"$f":"+I210/E210","v":0},{"$f":"+J210/E210","v":0},{"$f":"+K210/E210","v":0},null,{"$f":"D211/SUM(D210:D217)","v":{"$error":"#DIV/0!"}},{"$error":"#DIV/0!"},{"$error":"#DIV/0!"},{"$error":"#DIV/0!"},{"$error":"#DIV/0!"},{"$error":"#DIV/0!"},{"$error":"#DIV/0!"},{"$error":"#DIV/0!"},null,null,null,null,0,{"$f":"AVERAGE(M211:T211)","v":{"$error":"#DIV/0!"}},null,{"$error":"#DIV/0!"},{"$f":"AB211/Z211","v":{"$error":"#DIV/0!"}}]
[null,{"$f":"+'Definitie Criteria'!$C$17","v":0},{"$f":"+'Definitie Criteria'!$C$17","v":0},{"$f":"1/F210","v":0.2},{"$f":"1/F211","v":1},1,{"$f":"+G211/F211","v":1},{"$f":"+H211/F211","v":0},{"$f":"+I211/F211","v":0},{"$f":"+J211/F211","v":0},{"$f":"+K211/F211","v":0},null,{"$f":"D212/SUM(D210:D217)","v":{"$error":"#DIV/0!"}},{"$error":"#DIV/0!"},{"$error":"#DIV/0!"},{"$error":"#DIV/0!"},{"$error":"#DIV/0!"},{"$error":"#DIV/0!"},{"$error":"#DIV/0!"},{"$error":"#DIV/0!"},null,null,null,null,0,{"$error":"#DIV/0!"},null,{"$error":"#DIV/0!"},{"$error":"#DIV/0!"}]
[null,{"$f":"+'Definitie Criteria'!$C$18","v":0},{"$f":"+'Definitie Criteria'!$C$18","v":0},{"$f":"1/G210","v":0.2},{"$f":"1/G211","v":1},{"$f":"1/G212","v":1},1,{"$f":"+H212/G212","v":0},{"$f":"+I212/G212","v":0},{"$f":"+J212/G212","v":0},{"$f":"+K212/G212","v":0},null,{"$f":"D213/SUM(D210:D217)","v":{"$error":"#DIV/0!"}},{"$error":"#DIV/0!"},{"$error":"#DIV/0!"},{"$error":"#DIV/0!"},{"$error":"#DIV/0!"},{"$error":"#DIV/0!"},{"$error":"#DIV/0!"},{"$error":"#DIV/0!"},null,null,null,null,0,{"$error":"#DIV/0!"},null,{"$error":"#DIV/0!"},{"$error":"#DIV/0!"}]
[null,{"$f":"+'Definitie Criteria'!$C$19","v":0},{"$f":"+'Definitie Criteria'!$C$19","v":0},{"$f":"1/H210","v":{"$error":"#DIV/0!"}},{"$f":"1/H211","v":{"$error":"#DIV/0!"}},{"$f":"1/H212","v":{"$error":"#DIV/0!"}},{"$f":"1/H213","v":{"$error":"#DIV/0!"}},1,{"$f":"+I213/H213","v":{"$error":"#DIV/0!"}},{"$f":"+J213/H213","v":{"$error":"#DIV/0!"}},{"$f":"+K213/H213","v":{"$error":"#DIV/0!"}},null,{"$f":"D214/SUM(D210:D217)","v":{"$error":"#DIV/0!"}},{"$error":"#DIV/0!"},{"$error":"#DIV/0!"},{"$error":"#DIV/0!"},{"$error":"#DIV/0!"},{"$error":"#DIV/0!"},{"$error":"#DIV/0!"},{"$error":"#DIV/0!"},null,null,null,null,0,{"$error":"#DIV/0!"},null,{"$error":"#DIV/0!"},{"$error":"#DIV/0!"}]
[null,{"$f":"+'Definitie Criteria'!$C$20","v":0},{"$f":"+'Definitie Criteria'!$C$20","v":0},{"$f":"1/I210","v":{"$error":"#DIV/0!"}},{"$f":"1/I211","v":{"$error":"#DIV/0!"}},{"$f":"1/I212","v":{"$error":"#DIV/0!"}},{"$f":"1/I213","v":{"$error":"#DIV/0!"}},{"$f":"1/I214","v":{"$error":"#DIV/0!"}},1,{"$f":"+J214/I214","v":{"$error":"#DIV/0!"}},{"$f":"+K214/I214","v":{"$error":"#DIV/0!"}},null,{"$f":"D215/SUM(D210:D217)","v":{"$error":"#DIV/0!"}},{"$error":"#DIV/0!"},{"$error":"#DIV/0!"},{"$error":"#DIV/0!"},{"$error":"#DIV/0!"},{"$error":"#DIV/0!"},{"$error":"#DIV/0!"},{"$error":"#DIV/0!"},null,null,null,null,0,{"$error":"#DIV/0!"},null,{"$error":"#DIV/0!"},{"$error":"#DIV/0!"}]
[null,{"$f":"+'Definitie Criteria'!$C$21","v":0},{"$f":"+'Definitie Criteria'!$C$21","v":0},{"$f":"1/J210","v":{"$error":"#DIV/0!"}},{"$f":"1/J211","v":{"$error":"#DIV/0!"}},{"$f":"1/J212","v":{"$error":"#DIV/0!"}},{"$f":"1/J213","v":{"$error":"#DIV/0!"}},{"$f":"1/J214","v":{"$error":"#DIV/0!"}},{"$f":"1/J215","v":{"$error":"#DIV/0!"}},1,{"$f":"+K215/J215","v":{"$error":"#DIV/0!"}},null,{"$f":"D216/SUM(D210:D217)","v":{"$error":"#DIV/0!"}},{"$error":"#DIV/0!"},{"$error":"#DIV/0!"},{"$error":"#DIV/0!"},{"$error":"#DIV/0!"},{"$error":"#DIV/0!"},{"$error":"#DIV/0!"},{"$error":"#DIV/0!"},null,null,null,null,0,{"$error":"#DIV/0!"},null,{"$error":"#DIV/0!"},{"$error":"#DIV/0!"}]
[null,{"$f":"+'Definitie Criteria'!$C$22","v":0},{"$f":"+'Definitie Criteria'!$C$22","v":0},{"$f":"1/K210","v":{"$error":"#DIV/0!"}},{"$f":"1/K211","v":{"$error":"#DIV/0!"}},{"$f":"1/K212","v":{"$error":"#DIV/0!"}},{"$f":"1/K213","v":{"$error":"#DIV/0!"}},{"$f":"1/K214","v":{"$error":"#DIV/0!"}},{"$f":"1/K215","v":{"$error":"#DIV/0!"}},{"$f":"1/K216","v":{"$error":"#DIV/0!"}},1,null,{"$f":"D217/SUM(D210:D217)","v":{"$error":"#DIV/0!"}},{"$error":"#DIV/0!"},{"$error":"#DIV/0!"},{"$error":"#DIV/0!"},{"$error":"#DIV/0!"},{"$error":"#DIV/0!"},{"$error":"#DIV/0!"},{"$error":"#DIV/0!"},null,null,null,null,0,{"$error":"#DIV/0!"},null,{"$error":"#DIV/0!"},{"$error":"#DIV/0!"}]
[null,null,null,null,null,null,null,null,null,null,null,null,null,null,null,null,null,null,null,null,null,null,null,null,null,null,null,"CI=",{"$f":"(AVERAGE(AC210:AC217)-8)/7","v":{"$error":"#DIV/0!"}},"CI/RI=",{"$f":"AC218/1.41","v":{"$error":"#DIV/0!"}}]
["Analyse 8","Analyse",null,{"$f":"+Parameters!$E$15","v":0},{"$f":"+Parameters!$E$16","v":0},{"$f":"+Parameters!$E$17","v":0},{"$f":"+Parameters!$E$18","v":0},{"$f":"+Parameters!$E$19","v":0},{"$f":"+Parameters!$E$20","v":0},{"$f":"+Parameters!$E$21","v":0},{"$f":"+Parameters!$E$22","v":0}]
[null,null,{"$f":"+Parameters!$E$15","v":0}," ",{"$f":"ABS((E210-E200)/E210)","v":0},0,0,{"$error":"#DIV/0!"},{"$error":"#DIV/0!"},{"$error":"#DIV/0!"},{"$error":"#DIV/0!"}]
[null,null,{"$f":"+Parameters!$E$16","v":0},null," ",{"$f":"ABS((F211-F201)/F211)","v":4},4,{"$error":"#DIV/0!"},{"$error":"#DIV/0!"},{"$error":"#DIV/0!"},{"$error":"#DIV/0!"}]
[null,null,{"$f":"+Parameters!$E$17","v":0},null,null," ",{"$f":"ABS((G212-G202)/G212)","v":4},{"$f":"ABS((H212-H202)/H212)","v":{"$error":"#DIV/0!"}},{"$f":"ABS((I212-I202)/I212)","v":{"$error":"#DIV/0!"}},{"$f":"ABS((J212-J202)/J212)","v":{"$error":"#DIV/0!"}},{"$f":"ABS((K212-K202)/K212)","v":{"$error":"#DIV/0!"}}]
[null,null,{"$f":"+Parameters!$E$18","v":0},null,null,null," ",{"$f":"ABS((H213-H203)/H213)","v":{"$error":"#DIV/0!"}},{"$f":"ABS((I213-I203)/I213)","v":{"$error":"#DIV/0!"}},{"$f":"ABS((J213-J203)/J213)","v":{"$error":"#DIV/0!"}},{"$f":"ABS((K213-K203)/K213)","v":{"$error":"#DIV/0!"}}]
[null,null,{"$f":"+Parameters!$E$19","v":0},null,null,null,null," ",{"$f":"ABS((I214-I204)/I214)","v":{"$error":"#DIV/0!"}},{"$f":"ABS((J214-J204)/J214)","v":{"$error":"#DIV/0!"}},{"$f":"ABS((K214-K204)/K214)","v":{"$error":"#DIV/0!"}}]
[null,null,{"$f":"+Parameters!$E$20","v":0},null,null,null,null,null," ",{"$f":"ABS((J215-J205)/J215)","v":{"$error":"#DIV/0!"}},{"$f":"ABS((K215-K205)/K215)","v":{"$error":"#DIV/0!"}}]
[null,null,{"$f":"+Parameters!$E$21","v":0},null,null,null,null,null,null," ",{"$f":"ABS((K216-K206)/K216)","v":{"$error":"#DIV/0!"}}]
[null,null,{"$f":"+Parameters!$E$22","v":0},null,null,null,null,null,null,null," "]
[]
[]
["Matrix 9 Criteria","Matrix",null,{"$f":"+'Definitie Criteria'!$C$15","v":0},{"$f":"+'Definitie Criteria'!$C$16","v":0},{"$f":"+'Definitie Criteria'!$C$17","v":0},{"$f":"+'Definitie Criteria'!$C$18","v":0},{"$f":"+'Definitie Criteria'!$C$19","v":0},{"$f":"+'Definitie Criteria'!$C$20","v":0},{"$f":"+'Definitie Criteria'!$C$21","v":0},{"$f":"+'Definitie Criteria'!$C$22","v":0},{"$f":"+'Definitie Criteria'!$C$23","v":0},null,null,null,null,null,null,null,null,null,null,null,"Criterium",null,"%",null,"Product","Ratio"]
[null,null,{"$f":"+'Definitie Criteria'!$C$15","v":0},{"$f":"+C55","v":1},5,5,5,0,0,0,0,0,null,{"$f":"D231/SUM(D231:D239)","v":{"$error":"#DIV/0!"}},{"$error":"#DIV/0!"},{"$error":"#DIV/0!"},{"$error":"#DIV/0!"},{"$error":"#DIV/0!"},{"$error":"#DIV/0!"},{"$error":"#DIV/0!"},{"$error":"#DIV/0!"},0,null,null,{"$f":"+B231","v":0},{"$f":"AVERAGE(N231:V231)","v":{"$error":"#DIV/0!"}},null,{"$f":"MMULT(D231:L239,Z231:Z239)","v":{"$error":"#DIV/0!"}},{"$f":"AB231/Z231","v":{"$error":"#DIV/0!"}}]
[null,null,{"$f":"+'Definitie Criteria'!$C$16","v":0},{"$f":"+C56","v":0.2},1,5,5,0,0,0,0,0,null,{"$f":"D232/SUM(D231:D239)","v":{"$error":"#DIV/0!"}},{"$error":"#DIV/0!"},{"$error":"#DIV/0!"},{"$error":"#DIV/0!"},{"$error":"#DIV/0!"},{"$error":"#DIV/0!"},{"$error":"#DIV/0!"},{"$error":"#DIV/0!"},0,null,null,0,{"$error":"#DIV/0!"},null,{"$error":"#DIV/0!"},{"$error":"#DIV/0!"}]
[null,null,{"$f":"+'Definitie Criteria'!$C$17","v":0},{"$f":"+C57","v":0.2},0.2,1,5,0,0,0,0,0,null,{"$f":"D233/SUM(D231:D239)","v":{"$error":"#DIV/0!"}},{"$error":"#DIV/0!"},{"$error":"#DIV/0!"},{"$error":"#DIV/0!"},{"$error":"#DIV/0!"},{"$error":"#DIV/0!"},{"$error":"#DIV/0!"},{"$error":"#DIV/0!"},0,null,null,0,{"$error":"#DIV/0!"},null,{"$error":"#DIV/0!"},{"$error":"#DIV/0!"}]
[null,null,{"$f":"+'Definitie Criteria'!$C$18","v":0},{"$f":"+C58","v":0.2},0.2,0.2,1,0,0,0,0,0,null,{"$f":"D234/SUM(D231:D239)","v":{"$error":"#DIV/0!"}},{"$error":"#DIV/0!"},{"$error":"#DIV/0!"},{"$error":"#DIV/0!"},{"$error":"#DIV/0!"},{"$error":"#DIV/0!"},{"$error":"#DIV/0!"},{"$error":"#DIV/0!"},0,null,null,0,{"$error":"#DIV/0!"},null,{"$error":"#DIV/0!"},{"$error":"#DIV/0!"}]
[null,null,{"$f":"+'Definitie Criteria'!$C$19","v":0},{"$f":"+C59","v":{"$error":"#DIV/0!"}},{"$error":"#DIV/0!"},{"$error":"#DIV/0!"},{"$error":"#DIV/0!"},1,0,0,0,0,null,{"$f":"D235/SUM(D231:D239)","v":{"$error":"#DIV/0!"}},{"$error":"#DIV/0!"},{"$error":"#DIV/0!"},{"$error":"#DIV/0!"},{"$error":"#DIV/0!"},{"$error":"#DIV/0!"},{"$error":"#DIV/0!"},{"$error":"#DIV/0!"},0,null,null,0,{"$error":"#DIV/0!"},null,{"$error":"#DIV/0!"},{"$error":"#DIV/0!"}]
[null,null,{"$f":"+'Definitie Criteria'!$C$20","v":0},{"$f":"+C60","v":{"$error":"#DIV/0!"}},{"$error":"#DIV/0!"},{"$error":"#DIV/0!"},{"$error":"#DIV/0!"},{"$error":"#DIV/0!"},1,0,0,0,null,{"$f":"D236/SUM(D231:D239)","v":{"$error":"#DIV/0!"}},{"$error":"#DIV/0!"},{"$error":"#DIV/0!"},{"$error":"#DIV/0!"},{"$error":"#DIV/0!"},{"$error":"#DIV/0!"},{"$error":"#DIV/0!"},{"$error":"#DIV/0!"},0,null,null,0,{"$error":"#DIV/0!"},null,{"$error":"#DIV/0!"},{"$error":"#DIV/0!"}]
[null,null,{"$f":"+'Definitie Criteria'!$C$21","v":0},{"$f":"+C61","v":{"$error":"#DIV/0!"}},{"$error":"#DIV/0!"},{"$error":"#DIV/0!"},{"$error":"#DIV/0!"},{"$error":"#DIV/0!"},{"$error":"#DIV/0!"},1,0,0,null,{"$f":"D237/SUM(D231:D239)","v":{"$error":"#DIV/0!"}},{"$error":"#DIV/0!"},{"$error":"#DIV/0!"},{"$error":"#DIV/0!"},{"$error":"#DIV/0!"},{"$error":"#DIV/0!"},{"$error":"#DIV/0!"},{"$error":"#DIV/0!"},0,null,null,0,{"$error":"#DIV/0!"},null,{"$error":"#DIV/0!"},{"$error":"#DIV/0!"}]
[null,null,{"$f":"+'Definitie Criteria'!$C$22","v":0},{"$f":"+C62","v":{"$error":"#DIV/0!"}},{"$error":"#DIV/0!"},{"$error":"#DIV/0!"},{"$error":"#DIV/0!"},{"$error":"#DIV/0!"},{"$error":"#DIV/0!"},{"$error":"#DIV/0!"},1,0,null,{"$f":"D238/SUM(D231:D239)","v":{"$error":"#DIV/0!"}},{"$error":"#DIV/0!"},{"$error":"#DIV/0!"},{"$error":"#DIV/0!"},{"$error":"#DIV/0!"},{"$error":"#DIV/0!"},{"$error":"#DIV/0!"},{"$error":"#DIV/0!"},0,null,null,0,{"$error":"#DIV/0!"},null,{"$error":"#DIV/0!"},{"$error":"#DIV/0!"}]
[null,null,{"$f":"+'Definitie Criteria'!$C$23","v":0},{"$f":"+C63","v":{"$error":"#DIV/0!"}},{"$error":"#DIV/0!"},{"$error":"#DIV/0!"},{"$error":"#DIV/0!"},{"$error":"#DIV/0!"},{"$error":"#DIV/0!"},{"$error":"#DIV/0!"},{"$error":"#DIV/0!"},1,null,{"$f":"D239/SUM(D231:D239)","v":{"$error":"#DIV/0!"}},{"$error":"#DIV/0!"},{"$error":"#DIV/0!"},{"$error":"#DIV/0!"},{"$error":"#DIV/0!"},{"$error":"#DIV/0!"},{"$error":"#DIV/0!"},{"$error":"#DIV/0!"},1,null,null,0,{"$error":"#DIV/0!"},null,{"$error":"#DIV/0!"},{"$error":"#DIV/0!"}]
[null,null,null,null,null,null,null,null,null,null,null,null,null,null,null,null,null,null,null,null,null,null,null,null,null,null,null,"CI=",{"$f":"(AVERAGE(AC231:AC239)-9)/8","v":{"$error":"#DIV/0!"}},"CI/RI=",{"$f":"AC240/1.45","v":{"$error":"#DIV/0!"}}]
["Matrix 9 Criteria (aangepast)","Optimaal",null,{"$f":"+'Definitie Criteria'!$C$15","v":0},{"$f":"+'Definitie Criteria'!$C$16","v":0},{"$f":"+'Definitie Criteria'!$C$17","v":0},{"$f":"+'Definitie Criteria'!$C$18","v":0},{"$f":"+'Definitie Criteria'!$C$19","v":0},{"$f":"+'Definitie Criteria'!$C$20","v":0},{"$f":"+'Definitie Criteria'!$C$21","v":0},{"$f":"+'Definitie Criteria'!$C$22","v":0},{"$f":"+'Definitie Criteria'!$C$23","v":0},null,null,null,null,null,null,null,null,null,null,null,"Criterium",null,"%",null,"Product","Ratio"]
[null,{"$f":"+'Definitie Criteria'!$C$15","v":0},{"$f":"+'Definitie Criteria'!$C$15","v":0},1,{"$f":"+Parameters!D55","v":5},{"$f":"+Parameters!E55","v":5},{"$f":"+Parameters!F55","v":5},{"$f":"+Parameters!G55","v":0},{"$f":"+Parameters!H55","v":0},{"$f":"+Parameters!I55","v":0},{"$f":"+Parameters!J55","v":0},{"$f":"+Parameters!K55","v":0},null,{"$f":"D242/SUM(D242:D250)","v":{"$error":"#DIV/0!"}},{"$error":"#DIV/0!"},{"$error":"#DIV/0!"},{"$error":"#DIV/0!"},{"$error":"#DIV/0!"},{"$error":"#DIV/0!"},{"$error":"#DIV/0!"},{"$error":"#DIV/0!"},{"$error":"#DIV/0!"},null,null,{"$f":"+B242","v":0},{"$f":"AVERAGE(N242:V242)","v":{"$error":"#DIV/0!"}},null,{"$f":"MMULT(D242:L250,Z242:Z250)","v":{"$error":"#DIV/0!"}},{"$f":"AB242/Z242","v":{"$error":"#DIV/0!"}}]
[null,{"$f":"+'Definitie Criteria'!$C$16","v":0},{"$f":"+'Definitie Criteria'!$C$16","v":0},{"$f":"1/E242","v":0.2},1,{"$f":"+F242/E242","v":1},{"$f":"+G242/E242","v":1},{"$f":"+H242/E242","v":0},{"$f":"+I242/E242","v":0},{"$f":"+J242/E242","v":0},{"$f":"+K242/E242","v":0},{"$f":"+L242/E242","v":0},null,{"$f":"D243/SUM(D242:D250)","v":{"$error":"#DIV/0!"}},{"$error":"#DIV/0!"},{"$error":"#DIV/0!"},{"$error":"#DIV/0!"},{"$error":"#DIV/0!"},{"$error":"#DIV/0!"},{"$error":"#DIV/0!"},{"$error":"#DIV/0!"},{"$error":"#DIV/0!"},null,null,0,{"$error":"#DIV/0!"},null,{"$error":"#DIV/0!"},{"$error":"#DIV/0!"}]
[null,{"$f":"+'Definitie Criteria'!$C$17","v":0},{"$f":"+'Definitie Criteria'!$C$17","v":0},{"$f":"1/F242","v":0.2},{"$f":"1/F243","v":1},1,{"$f":"+G243/F243","v":1},{"$f":"+H243/F243","v":0},{"$f":"+I243/F243","v":0},{"$f":"+J243/F243","v":0},{"$f":"+K243/F243","v":0},{"$f":"+L243/F243","v":0},null,{"$f":"D244/SUM(D242:D250)","v":{"$error":"#DIV/0!"}},{"$error":"#DIV/0!"},{"$error":"#DIV/0!"},{"$error":"#DIV/0!"},{"$error":"#DIV/0!"},{"$error":"#DIV/0!"},{"$error":"#DIV/0!"},{"$error":"#DIV/0!"},{"$error":"#DIV/0!"},null,null,0,{"$error":"#DIV/0!"},null,{"$error":"#DIV/0!"},{"$error":"#DIV/0!"}]
[null,{"$f":"+'Definitie Criteria'!$C$18","v":0},{"$f":"+'Definitie Criteria'!$C$18","v":0},{"$f":"1/G242","v":0.2},{"$f":"1/G243","v":1},{"$f":"1/G244","v":1},1,{"$f":"+H244/G244","v":0},{"$f":"+I244/G244","v":0},{"$f":"+J244/G244","v":0},{"$f":"+K244/G244","v":0},{"$f":"+L244/G244","v":0},null,{"$f":"D245/SUM(D242:D250)","v":{"$error":"#DIV/0!"}},{"$error":"#DIV/0!"},{"$error":"#DIV/0!"},{"$error":"#DIV/0!"},{"$error":"#DIV/0!"},{"$error":"#DIV/0!"},{"$error":"#DIV/0!"},{"$error":"#DIV/0!"},{"$error":"#DIV/0!"},null,null,0,{"$error":"#DIV/0!"},null,{"$error":"#DIV/0!"},{"$error":"#DIV/0!"}]
[null,{"$f":"+'Definitie Criteria'!$C$19","v":0},{"$f":"+'Definitie Criteria'!$C$19","v":0},{"$f":"1/H242","v":{"$error":"#DIV/0!"}},{"$f":"1/H243","v":{"$error":"#DIV/0!"}},{"$f":"1/H244","v":{"$error":"#DIV/0!"}},{"$f":"1/H245","v":{"$error":"#DIV/0!"}},1,{"$f":"+I245/H245","v":{"$error":"#DIV/0!"}},{"$f":"+J245/H245","v":{"$error":"#DIV/0!"}},{"$f":"+K245/H245","v":{"$error":"#DIV/0!"}},{"$f":"+L245/H245","v":{"$error":"#DIV/0!"}},null,{"$f":"D246/SUM(D242:D250)","v":{"$error":"#DIV/0!"}},{"$error":"#DIV/0!"},{"$error":"#DIV/0!"},{"$error":"#DIV/0!"},{"$error":"#DIV/0!"},{"$error":"#DIV/0!"},{"$error":"#DIV/0!"},{"$error":"#DIV/0!"},{"$error":"#DIV/0!"},null,null,0,{"$error":"#DIV/0!"},null,{"$error":"#DIV/0!"},{"$error":"#DIV/0!"}]
[null,{"$f":"+'Definitie Criteria'!$C$20","v":0},{"$f":"+'Definitie Criteria'!$C$20","v":0},{"$f":"1/I242","v":{"$error":"#DIV/0!"}},{"$f":"1/I243","v":{"$error":"#DIV/0!"}},{"$f":"1/I244","v":{"$error":"#DIV/0!"}},{"$f":"1/I245","v":{"$error":"#DIV/0!"}},{"$f":"1/I246","v":{"$error":"#DIV/0!"}},1,{"$f":"+J246/I246","v":{"$error":"#DIV/0!"}},{"$f":"+K246/I246","v":{"$error":"#DIV/0!"}},{"$f":"+L246/I246","v":{"$error":"#DIV/0!"}},null,{"$f":"D247/SUM(D242:D250)","v":{"$error":"#DIV/0!"}},{"$error":"#DIV/0!"},{"$error":"#DIV/0!"},{"$error":"#DIV/0!"},{"$error":"#DIV/0!"},{"$error":"#DIV/0!"},{"$error":"#DIV/0!"},{"$error":"#DIV/0!"},{"$error":"#DIV/0!"},null,null,0,{"$error":"#DIV/0!"},null,{"$error":"#DIV/0!"},{"$error":"#DIV/0!"}]
[null,{"$f":"+'Definitie Criteria'!$C$21","v":0},{"$f":"+'Definitie Criteria'!$C$21","v":0},{"$f":"1/J242","v":{"$error":"#DIV/0!"}},{"$f":"1/J243","v":{"$error":"#DIV/0!"}},{"$f":"1/J244","v":{"$error":"#DIV/0!"}},{"$f":"1/J245","v":{"$error":"#DIV/0!"}},{"$f":"1/J246","v":{"$error":"#DIV/0!"}},{"$f":"1/J247","v":{"$error":"#DIV/0!"}},1,{"$f":"+K247/J247","v":{"$error":"#DIV/0!"}},{"$f":"+L247/J247","v":{"$error":"#DIV/0!"}},null,{"$f":"D248/SUM(D242:D250)","v":{"$error":"#DIV/0!"}},{"$error":"#DIV/0!"},{"$error":"#DIV/0!"},{"$error":"#DIV/0!"},{"$error":"#DIV/0!"},{"$error":"#DIV/0!"},{"$error":"#DIV/0!"},{"$error":"#DIV/0!"},{"$error":"#DIV/0!"},null,null,0,{"$error":"#DIV/0!"},null,{"$error":"#DIV/0!"},{"$error":"#DIV/0!"}]
[null,{"$f":"+'Definitie Criteria'!$C$22","v":0},{"$f":"+'Definitie Criteria'!$C$22","v":0},{"$f":"1/K242","v":{"$error":"#DIV/0!"}},{"$f":"1/K243","v":{"$error":"#DIV/0!"}},{"$f":"1/K244","v":{"$error":"#DIV/0!"}},{"$f":"1/K245","v":{"$error":"#DIV/0!"}},{"$f":"1/K246","v":{"$error":"#DIV/0!"}},{"$f":"1/K247","v":{"$error":"#DIV/0!"}},{"$f":"1/K248","v":{"$error":"#DIV/0!"}},{"$f":"+Parameters!J62","v":1},{"$f":"+L248/K248","v":{"$error":"#DIV/0!"}},null,{"$f":"D249/SUM(D242:D250)","v":{"$error":"#DIV/0!"}},{"$error":"#DIV/0!"},{"$error":"#DIV/0!"},{"$error":"#DIV/0!"},{"$error":"#DIV/0!"},{"$error":"#DIV/0!"},{"$error":"#DIV/0!"},{"$error":"#DIV/0!"},{"$error":"#DIV/0!"},null,null,0,{"$error":"#DIV/0!"},null,{"$error":"#DIV/0!"},{"$error":"#DIV/0!"}]
[null,{"$f":"+'Definitie Criteria'!$C$23","v":0},{"$f":"+'Definitie Criteria'!$C$23","v":0},{"$f":"1/L242","v":{"$error":"#DIV/0!"}},{"$f":"1/L243","v":{"$error":"#DIV/0!"}},{"$f":"1/L244","v":{"$error":"#DIV/0!"}},{"$f":"1/L245","v":{"$error":"#DIV/0!"}},{"$f":"1/L246","v":{"$error":"#DIV/0!"}},{"$f":"1/L247","v":{"$error":"#DIV/0!"}},{"$f":"1/L248","v":{"$error":"#DIV/0!"}},{"$f":"1/L249","v":{"$error":"#DIV/0!"}},{"$f":"+Parameters!K63","v":1},null,{"$f":"D250/SUM(D242:D250)","v":{"$error":"#DIV/0!"}},{"$error":"#DIV/0!"},{"$error":"#DIV/0!"},{"$error":"#DIV/0!"},{"$error":"#DIV/0!"},{"$error":"#DIV/0!"},{"$error":"#DIV/0!"},{"$error":"#DIV/0!"},{"$error":"#DIV/0!"},null,null,0,{"$error":"#DIV/0!"},null,{"$error":"#DIV/0!"},{"$error":"#DIV/0!"}]
[null,null,null,null,null,null,null,null,null,null,null,null,null,null,null,null,null,null,null,null,null,null,null,null,null,null,null,"CI=",{"$f":"(AVERAGE(AC242:AC250)-9)/8","v":{"$error":"#DIV/0!"}},"CI/RI=",{"$f":"AC251/1.45","v":{"$error":"#DIV/0!"}}]
["Analyse 9","Analyse",null,{"$f":"+Parameters!$E$15","v":0},{"$f":"+Parameters!$E$16","v":0},{"$f":"+Parameters!$E$17","v":0},{"$f":"+Parameters!$E$18","v":0},{"$f":"+Parameters!$E$19","v":0},{"$f":"+Parameters!$E$20","v":0},{"$f":"+Parameters!$E$21","v":0},{"$f":"+Parameters!$E$22","v":0},{"$f":"+Parameters!$E$23","v":0}]
[null,null,{"$f":"+Parameters!$E$15","v":0}," ",{"$f":"ABS((E242-E231)/E242)","v":0},0,0,{"$error":"#DIV/0!"},{"$error":"#DIV/0!"},{"$error":"#DIV/0!"},{"$error":"#DIV/0!"},{"$error":"#DIV/0!"}]
[null,null,{"$f":"+Parameters!$E$16","v":0},null,null,{"$f":"ABS((F243-F232)/F243)","v":4},4,{"$error":"#DIV/0!"},{"$error":"#DIV/0!"},{"$error":"#DIV/0!"},{"$error":"#DIV/0!"},{"$error":"#DIV/0!"}]
[null,null,{"$f":"+Parameters!$E$17","v":0},null,null,null,{"$f":"ABS((G244-G233)/G244)","v":4},{"$error":"#DIV/0!"},{"$error":"#DIV/0!"},{"$error":"#DIV/0!"},{"$error":"#DIV/0!"},{"$error":"#DIV/0!"}]
[null,null,{"$f":"+Parameters!$E$18","v":0},null,null,null," ",{"$f":"ABS((H245-H234)/H245)","v":{"$error":"#DIV/0!"}},{"$f":"ABS((I245-I234)/I245)","v":{"$error":"#DIV/0!"}},{"$f":"ABS((J245-J234)/J245)","v":{"$error":"#DIV/0!"}},{"$f":"ABS((K245-K234)/K245)","v":{"$error":"#DIV/0!"}},{"$f":"ABS((L245-L234)/L245)","v":{"$error":"#DIV/0!"}}]
[null,null,{"$f":"+Parameters!$E$19","v":0},null,null,null,null," ",{"$f":"ABS((I246-I235)/I246)","v":{"$error":"#DIV/0!"}},{"$f":"ABS((J246-J235)/J246)","v":{"$error":"#DIV/0!"}},{"$f":"ABS((K246-K235)/K246)","v":{"$error":"#DIV/0!"}},{"$f":"ABS((L246-L235)/L246)","v":{"$error":"#DIV/0!"}}]
[null,null,{"$f":"+Parameters!$E$20","v":0},null,null,null,null,null," ",{"$f":"ABS((J247-J236)/J247)","v":{"$error":"#DIV/0!"}},{"$f":"ABS((K247-K236)/K247)","v":{"$error":"#DIV/0!"}},{"$f":"ABS((L247-L236)/L247)","v":{"$error":"#DIV/0!"}}]
[null,null,{"$f":"+Parameters!$E$21","v":0},null,null,null,null,null,null," ",{"$f":"ABS((K248-K237)/K248)","v":{"$error":"#DIV/0!"}},{"$f":"ABS((L248-L237)/L248)","v":{"$error":"#DIV/0!"}}]
[null,null,{"$f":"+Parameters!$E$22","v":0},null,null,null,null,null,null,null," ",{"$f":"ABS((L249-L238)/L249)","v":{"$error":"#DIV/0!"}}]
[null,null,{"$f":"+Parameters!$E$23","v":0},null,null,null,null,null,null,null,null," "]
[]
[]
[null,null,null,null,null,null,null,null,null,null,null,null,null,"Totaal"]
["T.b.v. grafiek",null,null,null,null,null,null,null,null,null,null,"Grafiek","Prijs","Criteria"]
["Standaard",null,null,null,null,null,null,null,null,null,null,{"$f":"E13","v":0},{"$f":"+M21","v":0},{"$f":"+L266+M266","v":0}]
[]
[null,null,3,4,5,6,7,8,9,null,"Criterium","Percentage","Percentage",null,null,null,"Criteria","%",null,"CI/RI",null,null,null,null," ","Criteria","%",null,"CI/RI"]
[null,"Criteria 1",{"$f":"+Z90","v":0.65842759391146488},{"$f":"+Z106","v":0.54129464285714279},{"$f":"+Z125","v":{"$error":"#DIV/0!"}},{"$f":"+Z147","v":{"$error":"#DIV/0!"}},{"$f":"+Z172","v":{"$error":"#DIV/0!"}},{"$f":"+Z200","v":{"$error":"#DIV/0!"}},{"$f":"+Z231","v":{"$error":"#DIV/0!"}},null,1,{"$f":"HLOOKUP($L$266,$C$268:$I$277,K269+1,FALSE)","v":{"$error":"#N/A"}},{"$f":"HLOOKUP($L$266+1,$C$281:$I$291,K269+1,FALSE)","v":{"$error":"#N/A"}},null,null,null,{"$f":"IF($M$21=1,\"Prijs\",+E15)","v":0},{"$f":"IF($M$266=1,M269,L269)","v":{"$error":"#N/A"}},null,{"$f":"VLOOKUP($E$13,$O$285:$Q$291,2,FALSE)","v":{"$error":"#N/A"}},null,null,null,null,null,{"$f":"IF($M$21=1,\"Prijs\",+E15)","v":0},{"$f":"IF($M$266=1,M297,L297)","v":{"$error":"#N/A"}},null,{"$f":"VLOOKUP($E$13,$O$285:$Q$291,3,FALSE)","v":{"$error":"#N/A"}}]
[null,"Criteria 2",{"$f":"+Z91","v":0.25289763999441423},{"$f":"+Z107","v":0.26004464285714285},{"$f":"+Z126","v":{"$error":"#DIV/0!"}},{"$error":"#DIV/0!"},{"$error":"#DIV/0!"},{"$error":"#DIV/0!"},{"$error":"#DIV/0!"},null,2,{"$f":"HLOOKUP($L$266,$C$268:$I$277,K270+1,FALSE)","v":{"$error":"#N/A"}},{"$error":"#N/A"},null,null,null,{"$f":"IF($M$21=1,+E15,+E16)","v":0},{"$error":"#N/A"},null,null,null,null,null,null,null,{"$f":"IF($M$21=1,+E15,+E16)","v":0},{"$error":"#N/A"}]
[null,"Criteria 3",{"$f":"+Z92","v":8.8674766094120949E-2},{"$f":"+Z108","v":0.13950892857142858},{"$f":"+Z127","v":{"$error":"#DIV/0!"}},{"$error":"#DIV/0!"},{"$error":"#DIV/0!"},{"$error":"#DIV/0!"},{"$error":"#DIV/0!"},null,3,{"$f":"HLOOKUP($L$266,$C$268:$I$277,K271+1,FALSE)","v":{"$error":"#N/A"}},{"$error":"#N/A"},null,null,null,0,{"$error":"#N/A"},null,null,null,null,null,null,null,0,{"$error":"#N/A"}]
[null,"Criteria 4",null,{"$f":"+Z109","v":5.9151785714285719E-2},{"$f":"+Z128","v":{"$error":"#DIV/0!"}},{"$error":"#DIV/0!"},{"$error":"#DIV/0!"},{"$error":"#DIV/0!"},{"$error":"#DIV/0!"},null,4,{"$error":"#N/A"},{"$error":"#N/A"},null,null,null,0,{"$error":"#N/A"},null,null,null,null,null,null,null,0,{"$error":"#N/A"}]
[null,"Criteria 5",null,null,{"$f":"+Z129","v":{"$error":"#DIV/0!"}},{"$error":"#DIV/0!"},{"$error":"#DIV/0!"},{"$error":"#DIV/0!"},{"$error":"#DIV/0!"},null,5,{"$error":"#N/A"},{"$error":"#N/A"},null,null,null,0,{"$error":"#N/A"},null,null,null,null,null,null,null,0,{"$error":"#N/A"}]
[null,"Criteria 6",null,null,null,{"$error":"#DIV/0!"},{"$error":"#DIV/0!"},{"$error":"#DIV/0!"},{"$error":"#DIV/0!"},null,6,{"$error":"#N/A"},{"$error":"#N/A"},null,null,null,0,{"$error":"#N/A"},null,null,null,null,null,null,null,0,{"$error":"#N/A"}]
[null,"Criteria 7",null,null,null,null,{"$error":"#DIV/0!"},{"$error":"#DIV/0!"},{"$error":"#DIV/0!"},null,7,{"$error":"#N/A"},{"$error":"#N/A"},null,null,null,0,{"$error":"#N/A"},null,null,null,null,null,null,null,0,{"$error":"#N/A"}]
[null,"Criteria 8",null,null,null,null,null,{"$error":"#DIV/0!"},{"$error":"#DIV/0!"},null,8,{"$error":"#N/A"},{"$error":"#N/A"},null,null,null,0,{"$error":"#N/A"},null,null,null,null,null,null,null,0,{"$error":"#N/A"}]
[null,"Criteria 9",null,null,null,null,null,null,{"$error":"#DIV/0!"},null,9,{"$error":"#N/A"},{"$error":"#N/A"},null,null,null,0,{"$error":"#N/A"},null,null,null,null,null,null,null,0,{"$error":"#N/A"}]
[null,null,{"$f":"SUM(C269:C277)","v":1},0.99999999999999989,{"$error":"#DIV/0!"},{"$error":"#DIV/0!"},{"$error":"#DIV/0!"},{"$error":"#DIV/0!"},{"$error":"#DIV/0!"},null,10,null,{"$error":"#N/A"},null,null,null,0,0,null,null,null,null,null,null,null,0,0]
[]
[]
[null,null,4,5,6,7,8,9,10,null,null,null,null,null,"CI/RI"]
[null,{"$f":"IF($M$21=1,\"Prijs\",+B269)","v":"Criteria 1"},{"$f":"IF($M$21=1,+xPrijs,C269)","v":0.65842759391146488},0.54129464285714279,{"$error":"#DIV/0!"},{"$error":"#DIV/0!"},{"$error":"#DIV/0!"},{"$error":"#DIV/0!"},{"$error":"#DIV/0!"}]
[null,{"$f":"IF($M$21=1,+B269,+B270)","v":"Criteria 2"},{"$f":"IF($M$21=1,((C269/1)*(1-xPrijs)),C269)","v":0.65842759391146488},0.54129464285714279,{"$error":"#DIV/0!"},{"$error":"#DIV/0!"},{"$error":"#DIV/0!"},{"$error":"#DIV/0!"},{"$error":"#DIV/0!"},null,null,null,null,null,"Aantal","CI","CI "]
[null,"Criteria 3",0.25289763999441423,0.26004464285714285,{"$error":"#DIV/0!"},{"$error":"#DIV/0!"},{"$error":"#DIV/0!"},{"$error":"#DIV/0!"},{"$error":"#DIV/0!"},null,null,null,null,null,"criteria","standaard","aangepast"]
[null,"Criteria 4",8.8674766094120949E-2,0.13950892857142858,{"$error":"#DIV/0!"},{"$error":"#DIV/0!"},{"$error":"#DIV/0!"},{"$error":"#DIV/0!"},{"$error":"#DIV/0!"},null,null,null,null,null,3,{"$f":"+AE93","v":0.26527710369611585},{"$f":"+AE98","v":0}]
[null,"Criteria 5",null,{"$f":"IF($M$21=1,((D272/1)*(1-xPrijs)),D272)","v":5.9151785714285719E-2},{"$error":"#DIV/0!"},{"$error":"#DIV/0!"},{"$error":"#DIV/0!"},{"$error":"#DIV/0!"},{"$error":"#DIV/0!"},null,null,null,null,null,4,{"$f":"+AE110","v":0.2706571277480998},{"$f":"+AE116","v":0}]
[null,"Criteria 6",null,null,{"$f":"IF($M$21=1,((E273/1)*(1-xPrijs)),E273)","v":{"$error":"#DIV/0!"}},{"$f":"IF($M$21=1,((F273/1)*(1-xPrijs)),F273)","v":{"$error":"#DIV/0!"}},{"$f":"IF($M$21=1,((G273/1)*(1-xPrijs)),G273)","v":{"$error":"#DIV/0!"}},{"$f":"IF($M$21=1,((H273/1)*(1-xPrijs)),H273)","v":{"$error":"#DIV/0!"}},{"$f":"IF($M$21=1,((I273/1)*(1-xPrijs)),I273)","v":{"$error":"#DIV/0!"}},null,null,null,null,null,5,{"$f":"+AE130","v":{"$error":"#DIV/0!"}},{"$f":"+AE137","v":{"$error":"#DIV/0!"}}]
[null,"Criteria 7",null,null,null,{"$f":"IF($M$21=1,((F274/1)*(1-xPrijs)),F274)","v":{"$error":"#DIV/0!"}},{"$f":"IF($M$21=1,((G274/1)*(1-xPrijs)),G274)","v":{"$error":"#DIV/0!"}},{"$f":"IF($M$21=1,((H274/1)*(1-xPrijs)),H274)","v":{"$error":"#DIV/0!"}},{"$f":"IF($M$21=1,((I274/1)*(1-xPrijs)),I274)","v":{"$error":"#DIV/0!"}},null,null,null,null,null,6,{"$f":"+AE153","v":{"$error":"#DIV/0!"}},{"$f":"+AE161","v":{"$error":"#DIV/0!"}}]
[null,"Criteria 8",null,null,null,null,{"$f":"IF($M$21=1,((G275/1)*(1-xPrijs)),G275)","v":{"$error":"#DIV/0!"}},{"$f":"IF($M$21=1,((H275/1)*(1-xPrijs)),H275)","v":{"$error":"#DIV/0!"}},{"$f":"IF($M$21=1,((I275/1)*(1-xPrijs)),I275)","v":{"$error":"#DIV/0!"}},null,null,null,null,null,7,{"$f":"+AE179","v":{"$error":"#DIV/0!"}},{"$f":"+AE188","v":{"$error":"#DIV/0!"}}]
[null,"Criteria 9",null,null,null,null,null,{"$f":"IF($M$21=1,((H276/1)*(1-xPrijs)),H276)","v":{"$error":"#DIV/0!"}},{"$f":"IF($M$21=1,((I276/1)*(1-xPrijs)),I276)","v":{"$error":"#DIV/0!"}},null,null,null,null,null,8,{"$f":"+AE208","v":{"$error":"#DIV/0!"}},{"$f":"+AE218","v":{"$error":"#DIV/0!"}}]
[null,{"$f":"IF($M$21=1,+B277,+B281)","v":0},null,null,null,null,null,null,{"$f":"IF($M$21=1,((I277/1)*(1-xPrijs)),I277)","v":{"$error":"#DIV/0!"}},null,null,null,null,null,9,{"$f":"+AE240","v":{"$error":"#DIV/0!"}},{"$f":"+AE251","v":{"$error":"#DIV/0!"}}]
[null,null,{"$f":"SUM(C282:C291)","v":1.658427593911465},{"$f":"SUM(D282:D291)","v":1.5412946428571428},{"$error":"#DIV/0!"},{"$error":"#DIV/0!"},{"$error":"#DIV/0!"},{"$error":"#DIV/0!"},{"$error":"#DIV/0!"},null,null,null,null,null," "]
[null,null,null,null,null,null,null,null,null,null,null,null,null,null," "]
["T.b.v. grafiek"]
["Aangepast"]
[null,null,3,4,5,6,7,8,9,null,"Criterium","Percentage","Percentage"]
[null,"Criteria 1",{"$f":"+Z95","v":0.7142857142857143},{"$f":"+Z112","v":0.625},{"$f":"+Z132","v":{"$error":"#DIV/0!"}},{"$f":"+Z155","v":{"$error":"#DIV/0!"}},{"$f":"+Z181","v":{"$error":"#DIV/0!"}},{"$f":"+Z210","v":{"$error":"#DIV/0!"}},{"$f":"+Z242","v":{"$error":"#DIV/0!"}},null,1,{"$f":"HLOOKUP($L$266,$C$296:$I$305,K297+1,FALSE)","v":{"$error":"#N/A"}},{"$f":"HLOOKUP($L$266+1,$C$309:$I$319,K297+1,FALSE)","v":{"$error":"#N/A"}}]
[null,"Criteria 2",{"$f":"+Z96","v":0.14285714285714285},{"$f":"+Z113","v":0.125},{"$f":"+Z133","v":{"$error":"#DIV/0!"}},{"$error":"#DIV/0!"},{"$error":"#DIV/0!"},{"$error":"#DIV/0!"},{"$error":"#DIV/0!"},null,2,{"$error":"#N/A"},{"$error":"#N/A"}]
[null,"Criteria 3",{"$f":"+Z97","v":0.14285714285714285},{"$f":"+Z114","v":0.125},{"$f":"+Z134","v":{"$error":"#DIV/0!"}},{"$error":"#DIV/0!"},{"$error":"#DIV/0!"},{"$error":"#DIV/0!"},{"$error":"#DIV/0!"},null,3,{"$error":"#N/A"},{"$error":"#N/A"}]
[null,"Criteria 4",null,{"$f":"+Z115","v":0.125},{"$f":"+Z135","v":{"$error":"#DIV/0!"}},{"$error":"#DIV/0!"},{"$error":"#DIV/0!"},{"$error":"#DIV/0!"},{"$error":"#DIV/0!"},null,4,{"$error":"#N/A"},{"$error":"#N/A"}]
[null,"Criteria 5",null,null,{"$f":"+Z136","v":{"$error":"#DIV/0!"}},{"$error":"#DIV/0!"},{"$error":"#DIV/0!"},{"$error":"#DIV/0!"},{"$error":"#DIV/0!"},null,5,{"$error":"#N/A"},{"$error":"#N/A"}]
[null,"Criteria 6",null,null,null,{"$error":"#DIV/0!"},{"$error":"#DIV/0!"},{"$error":"#DIV/0!"},{"$error":"#DIV/0!"},null,6,{"$error":"#N/A"},{"$error":"#N/A"}]
[null,"Criteria 7",null,null,null,null,{"$error":"#DIV/0!"},{"$error":"#DIV/0!"},{"$error":"#DIV/0!"},null,7,{"$error":"#N/A"},{"$error":"#N/A"}]
[null,"Criteria 8",null,null,null,null,null,{"$error":"#DIV/0!"},{"$error":"#DIV/0!"},null,8,{"$error":"#N/A"},{"$error":"#N/A"}]
[null,"Criteria 9",null,null,null,null,null,null,{"$error":"#DIV/0!"},null,9,{"$error":"#N/A"},{"$error":"#N/A"}]
[null,null,{"$f":"SUM(C297:C305)","v":1},1,{"$error":"#DIV/0!"},{"$error":"#DIV/0!"},{"$error":"#DIV/0!"},{"$error":"#DIV/0!"},{"$error":"#DIV/0!"},null,10,null,{"$error":"#N/A"}]
[]
[]
[null,null,4,5,6,7,8,9,10]
[null,{"$f":"IF($M$21=1,\"Prijs\",+B297)","v":"Criteria 1"},{"$f":"IF($M$21=1,+xPrijs,C297)","v":0.7142857142857143},0.625,{"$error":"#DIV/0!"},{"$error":"#DIV/0!"},{"$error":"#DIV/0!"},{"$error":"#DIV/0!"},{"$error":"#DIV/0!"}]
[null,{"$f":"IF($M$21=1,+B297,+B298)","v":"Criteria 2"},{"$f":"IF($M$21=1,((C297/1)*(1-xPrijs)),C297)","v":0.7142857142857143},{"$f":"IF($M$21=1,((D297/1)*(1-xPrijs)),D297)","v":0.625},{"$error":"#DIV/0!"},{"$error":"#DIV/0!"},{"$error":"#DIV/0!"},{"$error":"#DIV/0!"},{"$error":"#DIV/0!"}]
[null,"Criteria 3",{"$f":"IF($M$21=1,((C298/1)*(1-xPrijs)),C298)","v":0.14285714285714285},0.125,{"$error":"#DIV/0!"},{"$error":"#DIV/0!"},{"$error":"#DIV/0!"},{"$error":"#DIV/0!"},{"$error":"#DIV/0!"}]
[null,"Criteria 4",{"$f":"IF($M$21=1,((C299/1)*(1-xPrijs)),C299)","v":0.14285714285714285},0.125,{"$error":"#DIV/0!"},{"$error":"#DIV/0!"},{"$error":"#DIV/0!"},{"$error":"#DIV/0!"},{"$error":"#DIV/0!"}]
[null,"Criteria 5",null,{"$f":"IF($M$21=1,((D300/1)*(1-xPrijs)),D300)","v":0.125},{"$error":"#DIV/0!"},{"$error":"#DIV/0!"},{"$error":"#DIV/0!"},{"$error":"#DIV/0!"},{"$error":"#DIV/0!"}]
[null,"Criteria 6",null,null,{"$f":"IF($M$21=1,((E301/1)*(1-xPrijs)),E301)","v":{"$error":"#DIV/0!"}},{"$f":"IF($M$21=1,((F301/1)*(1-xPrijs)),F301)","v":{"$error":"#DIV/0!"}},{"$f":"IF($M$21=1,((G301/1)*(1-xPrijs)),G301)","v":{"$error":"#DIV/0!"}},{"$f":"IF($M$21=1,((H301/1)*(1-xPrijs)),H301)","v":{"$error":"#DIV/0!"}},{"$f":"IF($M$21=1,((I301/1)*(1-xPrijs)),I301)","v":{"$error":"#DIV/0!"}}]
[null,"Criteria 7",null,null,null,{"$f":"IF($M$21=1,((F302/1)*(1-xPrijs)),F302)","v":{"$error":"#DIV/0!"}},{"$f":"IF($M$21=1,((G302/1)*(1-xPrijs)),G302)","v":{"$error":"#DIV/0!"}},{"$f":"IF($M$21=1,((H302/1)*(1-xPrijs)),H302)","v":{"$error":"#DIV/0!"}},{"$f":"IF($M$21=1,((I302/1)*(1-xPrijs)),I302)","v":{"$error":"#DIV/0!"}}]
[null,"Criteria 8",null,null,null,null,{"$f":"IF($M$21=1,((G303/1)*(1-xPrijs)),G303)","v":{"$error":"#DIV/0!"}},{"$f":"IF($M$21=1,((H303/1)*(1-xPrijs)),H303)","v":{"$error":"#DIV/0!"}},{"$f":"IF($M$21=1,((I303/1)*(1-xPrijs)),I303)","v":{"$error":"#DIV/0!"}}]
[null,"Criteria 9",null,null,null,null,null,{"$f":"IF($M$21=1,((H304/1)*(1-xPrijs)),H304)","v":{"$error":"#DIV/0!"}},{"$f":"IF($M$21=1,((I304/1)*(1-xPrijs)),I304)","v":{"$error":"#DIV/0!"}}]
[null,{"$f":"IF($M$21=1,+B305,+B309)","v":0},null,null,null,null,null,null,{"$f":"IF($M$21=1,((I305/1)*(1-xPrijs)),I305)","v":{"$error":"#DIV/0!"}}]
[null,null,{"$f":"SUM(C310:C319)","v":1.7142857142857142},{"$f":"SUM(D310:D319)","v":1.625},{"$error":"#DIV/0!"},{"$error":"#DIV/0!"},{"$error":"#DIV/0!"},{"$error":"#DIV/0!"},{"$error":"#DIV/0!"}]
[]
[]
[]
[]
[]
[null,null,null,null,null,{"$f":"NOW()","v":43795.640356481483}]
[]
[null,null,null,null,null,"uren"]
[null,null,null,null,null,"opzij","omhoog"]
[null,null,null,null,null,0,0]
[null,null,null,null,{"$f":"(HOUR(NOW())+MINUTE(NOW())/60)/12*2*PI()","v":8.0459678516938595},{"$f":"SIN(E331)*0.55","v":0.5398949508962152},{"$f":"COS(E331)*0.55","v":-0.10494494745709976}]
[]
[null,null,null,null,null,"minuten"]
[null,null,null,null,null,"opzij","omhoog"]
[null,null,null,null,null,0,0]
[null,null,null,null,{"$f":"(MINUTE(NOW())+SECOND(NOW())/60)/60*2*PI()","v":2.3160519173964751},{"$f":"SIN(E336)*0.8","v":0.58793167611996811},{"$f":"COS(E336)*0.8","v":-0.54252773589445635}]
[]
[null,null,null,null,null,"secondewijzer","lang deel"]
[null,null,null,null,null,"opzij","omhoog"]
[null,null,null,null,null,0,0]
[null,null,null,null,{"$f":"SECOND(NOW())/60*2*PI()","v":0.73303828583761843},{"$f":"SIN(E341)","v":0.66913060635885824},{"$f":"COS(E341)","v":0.74314482547739424}]
[null,null,null,null,null,"secondewijzer","kort deel"]
[null,null,null,null,null,"opzij","omhoog"]
[null,null,null,null,null,0,0]
[null,null,null,null,null,{"$f":"F341*-0.2","v":-0.13382612127177165},{"$f":"G341*-0.2","v":-0.14862896509547885}]

{"sheet":"Grafiek","index":7,"n_rows":47,"n_cols":15,"rows_kept":47,"cut":false,"hidden":false,"merged":[[9,14,9,17],[10,14,10,17]]}
[]
[]
[]
[]
[]
[]
[]
[]
[]
[null,null,null,null,null,null,null,null,null,null,null,null,null,"Nummer:",{"$f":"+Menu!$D$11","v":0}]
[null,null,null,null,null,null,null,null,null,null,null,null,null,"Naam:",{"$f":"+Menu!$D$12","v":0}]
[]
[]
[]
[]
[]
[]
[]
[]
[]
[]
[]
[]
[]
[]
[]
[]
[]
[]
[]
[]
[]
[]
[]
[]
[null,null,null,"Criteria","%",null,"CI/RI"]
[null,null,null,"Prijs",0.59,null,0.2706571277480998]
[null,null,null,"Criteria 1",0.22193080357142855]
[null,null,null,"Criteria 2",0.10661830357142858]
[null,null,null,"Criteria 3",5.7198660714285719E-2]
[null,null,null,"Criteria 4",2.4252232142857148E-2]
[]
[null,"Matrix",null,"Criteria 1","Criteria 2","Criteria 3","Criteria 4"]
[null,null,"Criteria 1",1,5,5,5]
[null,null,"Criteria 2",0.2,1,5,5]
[null,null,"Criteria 3",0.2,0.2,1,5]
[null,null,"Criteria 4",0.2,0.2,0.2,1]

{"sheet":"Analyse","index":8,"n_rows":59,"n_cols":16,"rows_kept":59,"cut":false,"hidden":false,"merged":[[49,1,49,2],[50,1,50,2],[51,1,51,2],[52,1,52,2],[9,14,9,17],[10,14,10,17]]}
[]
[]
[]
[]
[]
[]
[]
[]
[]
[null,null,null,null,null,null,null,null,null,null,null,null,null,"Nummer:",{"$f":"+Menu!$D$11","v":0}]
[null,null,null,null,null,null,null,null,null,null,null,null,null,"Naam:",{"$f":"+Menu!$D$12","v":0}]
[]
[]
[]
[]
[]
[]
[]
[]
[]
[]
[]
[]
[]
[]
[]
[]
[]
[]
[]
[]
[]
[]
[]
[]
[null,null,null,"Criteria","%",null,"CI/RI",null,null,null,null," ","Criteria","%",null,"CI/RI"]
[null,null,null,"Prijs",0.59,null,0.2706571277480998,null,null,null,null,null,"Prijs",0.59,null,0]
[null,null,null,"Criteria 1",0.22193080357142855,null,null,null,null,null,null,null,"Criteria 1",0.25625000000000003]
[null,null,null,"Criteria 2",0.10661830357142858,null,null,null,null,null,null,null,"Criteria 2",5.1250000000000004E-2]
[null,null,null,"Criteria 3",5.7198660714285719E-2,null,null,null,null,null,null,null,"Criteria 3",5.1250000000000004E-2]
[null,null,null,"Criteria 4",2.4252232142857148E-2,null,null,null,null,null,null,null,"Criteria 4",5.1250000000000004E-2]
[]
[null,"Matrix",null,"Criteria 1","Criteria 2","Criteria 3","Criteria 4"]
[null,null,"Criteria 1",1,5,5,5]
[null,null,"Criteria 2",0.2,1,5,5]
[null,null,"Criteria 3",0.2,0.2,1,5]
[null,null,"Criteria 4",0.2,0.2,0.2,1]
[]
[null,"Optimaal",null,"Criteria 1","Criteria 2","Criteria 3","Criteria 4"]
[null,"Criteria 1","Criteria 1",1,5,5,5]
[null,"Criteria 2","Criteria 2",0.2,1,1,1]
[null,"Criteria 3","Criteria 3",0.2,1,1,1]
[null,"Criteria 4","Criteria 4",0.2,1,1,1]
[]
[null,"Analyse",null,"Criteria 1","Criteria 2","Criteria 3","Criteria 4"]
[null,null,"Criteria 1"," ",0,0,0]
[null,null,"Criteria 2",null," ",4,4]
[null,null,"Criteria 3",null,null," ",4]
[null,null,"Criteria 4",null,null,null," "]