{"text_format":"1","workbook":"xlsx","n_sheets":9,"sheets":["Menu","Disclaimer","Definitie Criteria","PrijsKwaliteit","Paarsgewijs vergelijk","Einde Verdeling","Parameters","Grafiek","Analyse"],"not_rendered":{"charts":8,"images":9,"macros":1,"external_links":0,"defined_names":73,"comments":0,"pivot_tables":0},"unopened":[],"bounds":{"document_bytes":16777216,"sheet_cells":100000,"rows_first":2000,"rows_last":500,"rows_between":2000,"halvings":0,"cell_chars":16384,"cell_head_chars":4096},"cells_cut":0,"cells_raw":0,"read":"whole","date_system":"1900"}

{"sheet":"Menu","index":0,"n_rows":12,"n_cols":18,"rows_kept":12,"cut":false,"hidden":false,"merged":[[11,3,11,6],[10,3,10,6],[9,8,9,9]]}
[]
[]
[]
[]
[]
[]
[]
[]
[null,null,null,null,null,null,null,null,null,null,null,null,null,null,null,null,null,"versie 1.5"]
[null,null,null,null,null,null,null,null,null,null,null,null,null,null,null,null,null,"juni 2019"]
[null,null,"Kenmerk:",null,null,null,null,null,null,null,null,null,null,null,null,"Aantal criteria kwaliteit:",{"$f":"+'Definitie Criteria'!P15","v":0}]
[null,null,"Naam: ",null,null,null,null,null,null,null,null,null,null,null,null,"Prijscriterium actief:",{"$f":"+xPrijscriterium","v":0}]

{"sheet":"Disclaimer","index":1,"n_rows":28,"n_cols":13,"rows_kept":28,"cut":false,"hidden":false,"merged":[[27,12,27,15]]}
[]
[]
[null,null,"bf"]
[]
[]
[]
[]
[]
[]
[]
[]
[]
[null,null,"Disclaimer"]
[]
[]
[]
[]
[]
[]
[]
[]
[]
[]
[]
[]
[null,null,null,null,null,null,null,null,null,null,null,null,"© Juni 2019"]
[null,null,null,null,null,null,null,null,null,null,null,null,"IUC - Belastingdienst"]
[null,null,null,null,null,null,null,null,null,null,null,null,"procurement.economics@belastingdienst.nl"]

{"sheet":"Definitie Criteria","index":2,"n_rows":23,"n_cols":16,"rows_kept":23,"cut":false,"hidden":false,"merged":[[10,12,10,15],[11,12,11,15],[20,4,20,11],[22,4,22,11],[21,4,21,11],[15,4,15,11],[16,4,16,11],[17,4,17,11],[18,4,18,11],[19,4,19,11],[14,4,14,11],[19,2,19,3],[20,2,20,3],[21,2,21,3],[22,2,22,3],[14,2,14,3],[15,2,15,3],[16,2,16,3],[17,2,17,3],[18,2,18,3]]}
[]
[]
[]
[]
[]
[]
[]
[]
[]
[]
[null,null,null,null,null,null,null,null,null,null,null,"Nummer:",{"$f":"+Menu!D11","v":0}]
[null,null,null,null,null,null,null,null,null,null,null,"Naam: ",{"$f":"+Menu!D12","v":0}]
[null,null,"Gunningscriteria",null,"Toelichting"]
[]
[null,"criterium 1",null,null,null,null,null,null,null,null,null,null,null,null,"Aantal Criteria: ",{"$f":"9-((COUNTBLANK($C$15:$C$23)))","v":0}]
[null,"criterium 2"]
[null,"criterium 3"]
[null,"criterium 4"]
[null,"criterium 5"]
[null,"criterium 6"]
[null,"criterium 7"]
[null,"criterium 8"]
[null,"criterium 9"]

{"sheet":"PrijsKwaliteit","index":3,"n_rows":23,"n_cols":13,"rows_kept":23,"cut":false,"hidden":false,"merged":[[10,2,11,4],[10,12,10,15],[11,12,11,15]]}
[]
[]
[]
[]
[]
[]
[]
[]
[]
[]
[null,null,"Verhouding prijs / kwaliteit",null,null,null,null,null,null,null,null,"Nummer:",{"$f":"+Menu!D11","v":0}]
[null,null,null,null,null,null,null,null,null,null,null,"Naam: ",{"$f":"+Menu!D12","v":0}]
[null,null,null,"Ja"," "]
[null,null,null,"Nee"," "]
[null,null,"Criterium prijs actief --------->","Nee"]
[]
[]
[null,null,"Criterium","Percentage"]
[null,null,"Prijs",{"$f":"Parameters!M20/100","v":0.59}]
[null,null,"Kwaliteit",{"$f":"1-(Parameters!M20)/100","v":0.41000000000000003}]
[]
[]
[null,null,"Kwaliteit","   Prijs",null," "]

{"sheet":"Paarsgewijs vergelijk","index":4,"n_rows":28,"n_cols":17,"rows_kept":28,"cut":false,"hidden":false,"merged":[[27,3,28,8],[14,3,15,8],[10,2,11,12]]}
[]
[]
[]
[]
[]
[]
[]
[]
[]
[]
[null,null,"Paarsgewijs vergelijken"]
[]
[]
[null,null,null,{"$f":"VLOOKUP(Parameters!$K$42,Parameters!$D$15:$E$23,2,FALSE)","v":0}]
[null,null,null,{"$f":"VLOOKUP(Parameters!$K$42,Parameters!$D$25:$E$33,2,FALSE)","v":0}]
[]
[null,null,null,null,null,{"$f":"VLOOKUP(Parameters!$N$23,Parameters!$O$14:$P$30,2,FALSE)","v":5}]
[]
[]
[null,null,null,null,null,null,null,null,null,null,null,null,null," "," "," "," "]
[]
[]
[null,null,null,null,null,null,null,null,null,null," ",null," "]
[]
[null,null," "]
[null,null,null,null,null,{"$f":"VLOOKUP(Parameters!$N$24,Parameters!$O$14:$P$30,2,FALSE)","v":"1/5"}]
[null,null,null,{"$f":"VLOOKUP(Parameters!$K$43,Parameters!$D$15:$E$23,2,FALSE)","v":0}]
[null,null,null,{"$f":"VLOOKUP(Parameters!$K$43,Parameters!$D$25:$E$33,2,FALSE)","v":0}]

{"sheet":"Einde Verdeling","index":5,"n_rows":11,"n_cols":14,"rows_kept":11,"cut":false,"hidden":false,"merged":[[9,13,9,16],[10,13,10,16]]}
[]
[]
[]
[]
[]
[]
[]
[]
[]
[null,null,null,null,null,null,null,null,null,null,null,null,"Nummer:",{"$f":"+Menu!D11","v":0}]
[null,null,null,null,null,null,null,null,null,null,null,null,"Naam:",{"$f":"+Menu!D12","v":0}]

{"sheet":"Parameters","index":6,"n_rows":345,"n_cols":31,"rows_kept":345,"cut":false,"hidden":false,"merged":[[243,1,243,2],[180,1,180,2],[181,1,181,2],[182,1,182,2],[183,1,183,2],[184,1,184,2],[186,1,186,2],[185,1,185,2],[159,1,159,2],[94,1,94,2],[95,1,95,2],[96,1,96,2],[131,1,131,2],[132,1,132,2],[154,1,154,2],[157,1,157,2],[158,1,158,2],[133,1,133,2],[134,1,134,2],[135,1,135,2],[155,1,155,2],[156,1,156,2],[248,1,248,2],[249,1,249,2],[209,1,209,2],[210,1,210,2],[211,1,211,2],[212,1,212,2],[213,1,213,2],[241,1,241,2],[214,1,214,2],[215,1,215,2],[216,1,216,2],[246,1,246,2],[247,1,247,2],[244,1,244,2],[245,1,245,2],[242,1,242,2],[88,23,88,24],[123,23,123,24],[104,23,104,24],[93,23,93,24],[111,1,111,2],[112,1,112,2],[113,1,113,2],[114,1,114,2],[110,23,110,24],[179,23,179,24],[153,23,153,24],[130,23,130,24],[229,23,229,24],[198,23,198,24],[170,23,170,24],[145,23,145,24],[325,5,325,6],[327,5,327,6],[332,5,332,6],[240,23,240,24],[208,23,208,24]]}
[]
[]
[]
[]
[]
[]
[]
[]
[]
[]
[null,"Parameters"]
[]
[null,"Aantal criteria",null,null,{"$f":"+'Definitie Criteria'!P15","v":0},null,null,null,null,null,"Kleuren",null,"zwart",null,null,null,null,"Output schuifbalk"]
[null,null,null,null,null,null,null,null,null,null,"van ",null,"wit",null,9,9,null,1,-9]
[null,"Criteria 1",null,1,{"$f":"+'Definitie Criteria'!$C$15","v":0},"Criteria 1",null,null,null,null,"cel",null,null,null,8,8,null,2,-8]
[null,"Criteria 2",null,2,{"$f":"+'Definitie Criteria'!$C$16","v":0},"Criteria 2",null,null,null,null,null,null,null,null,7,7,null,3,-7]
[null,"Criteria 3",null,3,{"$f":"+'Definitie Criteria'!$C$17","v":0},"Criteria 3",null,null,null,null,null,null,null,null,6,6,null,4,-6]
[null,"Criteria 4",null,4,{"$f":"+'Definitie Criteria'!$C$18","v":0},"Criteria 4",null,null,null,null,"Ja",null,null,null,5,5,null,5,-5]
[null,"Criteria 5",null,5,{"$f":"+'Definitie Criteria'!$C$19","v":0},"Criteria 5",null,null,null,null,"Nee",null,null,null,4,4,null,6,-4]
[null,"Criteria 6",null,6,{"$f":"+'Definitie Criteria'!$C$20","v":0},"Criteria 6",null,null,null,null,"Percentage ",null,59,null,3,3,null,7,-3]
[null,"Criteria 7",null,7,{"$f":"+'Definitie Criteria'!$C$21","v":0},"Criteria 7",null,null,null,null,"Prijs voorgedefineerd:",null,{"$f":"IF(PrijsKwaliteit!D15=\"Ja\",1,0)","v":0},null,2,2,null,8,-2]
[null,"Criteria 8",null,8,{"$f":"+'Definitie Criteria'!$C$22","v":0},"Criteria 8",null,null,null,null,null,null,null,null,1,1,null,9,1]
[null,"Criteria 9",null,9,{"$f":"+'Definitie Criteria'!$C$23","v":0},"Criteria 9",null,null,null,null,"Waardevergelijk",null,{"$f":"VLOOKUP(M25,$R$14:$S$30,2,FALSE)","v":-5},{"$f":"IF(xWaardevergelijk<0,xWaardevergelijk*-1,IF(xWaardevergelijk=0,1,1 / xWaardevergelijk))","v":5},{"$f":"1/2","v":0.5},"1/2",null,10,2]
[null,null,null,null,null,null,null,null,null,null,null,null,null,{"$f":"1/N23","v":0.2},{"$f":"1/3","v":0.33333333333333331},"1/3",null,11,3]
[null,"Criteria 1",null,1,{"$f":"+'Definitie Criteria'!E15:L15","v":0},null,null,null,null,null,"Waarde uit schuifbalk",null,5,null,{"$f":"1/4","v":0.25},"1/4",null,12,4]
[null,"Criteria 2",null,2,{"$f":"+'Definitie Criteria'!E16:L16","v":0},null,null,null,null,null,null,null,null,null,{"$f":"1/5","v":0.2},"1/5",null,13,5]
[null,"Criteria 3",null,3,{"$f":"+'Definitie Criteria'!$E$17","v":0},null,null,null,null,null,null,null,null,null,{"$f":"1/6","v":0.16666666666666666},"1/6",null,14,6]
[null,"Criteria 4",null,4,{"$f":"+'Definitie Criteria'!$E$18","v":0},null,null,null,null,null,null,null,null,null,{"$f":"1/7","v":0.14285714285714285},"1/7",null,15,7]
[null,"Criteria 5",null,5,{"$f":"+'Definitie Criteria'!$E$19","v":0},null,null,null,null,null,null,null,null,null,{"$f":"1/8","v":0.125},"1/8",null,16,8]
[null,"Criteria 6",null,6,{"$f":"+'Definitie Criteria'!$E$20","v":0},null,null,null,null,null,null,null,null,null,{"$f":"1/9","v":0.1111111111111111},"1/9",null,17,9]
[null,"Criteria 7",null,7,{"$f":"+'Definitie Criteria'!$E$21","v":0}]
[null,"Criteria 8",null,8,{"$f":"+'Definitie Criteria'!$E$22","v":0}]
[null,"Criteria 9",null,9,{"$f":"+'Definitie Criteria'!$E$23","v":0}]
[]
[]
[]
[null,"Paarsgewijs vergelijk"]
[]
[null,null,null,null,"Circel"]
[null," Aantal","Aantal ",null,"diagram"]
[null,"criteria","vergelijken",null,"voortgang",null,null,null,null,"Teller",7]
[null,2,1,null,null,null,null,null,null,"Rij",4]
[null,3,3,null,"Te gaan",{"$f":"+xNogtegaan","v":{"$error":"#N/A"}},{"$f":"G46-K41+1","v":{"$error":"#N/A"}},null,null,"Kolom",5]
[null,4,6,null,"Gedaan",{"$f":"+xGedaan","v":{"$error":"#N/A"}},{"$f":"+G46-G43","v":{"$error":"#N/A"}},null,null,"Max",{"$f":"E13","v":0}]
[null,5,10,null,null,null,null,null,null,"Maxtellr",{"$f":"VLOOKUP($E$13,$B$42:$C$49,2,FALSE)","v":{"$error":"#N/A"}}]
[null,6,15,null,"Totaal",null,{"$f":"VLOOKUP(E13,B42:C49,2,FALSE)","v":{"$error":"#N/A"}}]
[null,7,21]
[null,8,28]
[null,9,36]
[]
[]
[null,"Matrix"]
[]
[null,null,"Crieteria 1","Crieteria 2","Crieteria 3","Crieteria 4","Crieteria 5","Crieteria 6","Crieteria 7","Crieteria 8","Crieteria 9"]
[null,"Crieteria 1",1,5,5,5]
[null,"Crieteria 2",{"$f":"1/D55","v":0.2},1,5,5]
[null,"Crieteria 3",{"$f":"1/E55","v":0.2},{"$f":"1/E56","v":0.2},1,5]
[null,"Crieteria 4",{"$f":"1/F55","v":0.2},{"$f":"1/F56","v":0.2},{"$f":"1/F57","v":0.2},1]
[null,"Crieteria 5",{"$f":"1/G55","v":{"$error":"#DIV/0!"}},{"$f":"1/G56","v":{"$error":"#DIV/0!"}},{"$f":"1/G57","v":{"$error":"#DIV/0!"}},{"$f":"1/G58","v":{"$error":"#DIV/0!"}},1]
[null,"Crieteria 6",{"$f":"1/H55","v":{"$error":"#DIV/0!"}},{"$f":"1/H56","v":{"$error":"#DIV/0!"}},{"$f":"1/H57","v":{"$error":"#DIV/0!"}},{"$f":"1/H58","v":{"$error":"#DIV/0!"}},{"$f":"1/H59","v":{"$error":"#DIV/0!"}},1]
[null,"Crieteria 7",{"$f":"1/I55","v":{"$error":"#DIV/0!"}},{"$f":"1/I56","v":{"$error":"#DIV/0!"}},{"$f":"1/I57","v":{"$error":"#DIV/0!"}},{"$f":"1/I58","v":{"$error":"#DIV/0!"}},{"$f":"1/I59","v":{"$error":"#DIV/0!"}},{"$f":"1/I60","v":{"$error":"#DIV/0!"}},1]
[null,"Crieteria 8",{"$f":"1/J55","v":{"$error":"#DIV/0!"}},{"$f":"1/J56","v":{"$error":"#DIV/0!"}},{"$f":"1/J57","v":{"$error":"#DIV/0!"}},{"$f":"1/J58","v":{"$error":"#DIV/0!"}},{"$f":"1/J59","v":{"$error":"#DIV/0!"}},{"$f":"1/J60","v":{"$error":"#DIV/0!"}},{"$f":"1/J61","v":{"$error":"#DIV/0!"}},1]
[null,"Crieteria 9",{"$f":"1/K55","v":{"$error":"#DIV/0!"}},{"$f":"1/K56","v":{"$error":"#DIV/0!"}},{"$f":"1/K57","v":{"$error":"#DIV/0!"}},{"$f":"1/K58","v":{"$error":"#DIV/0!"}},{"$f":"1/K59","v":{"$error":"#DIV/0!"}},{"$f":"1/K60","v":{"$error":"#DIV/0!"}},{"$f":"1/K61","v":{"$error":"#DIV/0!"}},{"$f":"1/K62","v":{"$error":"#DIV/0!"}},1]
[]
[]
[]
[null,"Keuze"]
[]
[null,null,null,null,null,"Ouput",0]
[null,1,"meer belangrijker",null,null,1,{"$f":"VLOOKUP(F70,$B$70:$C$71,2,FALSE)","v":"meer belangrijker"}]
[null,2,"minder belangrijker"]
[]
[]
[null,1,{"$f":"\"even \" &  $G$70","v":"even meer belangrijker"}]
[null,2,{"$f":"\"fractie \" &  $G$70","v":"fractie meer belangrijker"}]
[null,3,{"$f":"\"licht \" &  $G$70","v":"licht meer belangrijker"}]
[null,4,{"$f":"\"matig tot sterk \" &  $G$70","v":"matig tot sterk meer belangrijker"}]
[null,5,{"$f":"\"Sterk \" &  $G$70","v":"Sterk meer belangrijker"}]
[null,6,{"$f":"\"Sterk tot erg sterk \" &  $G$70","v":"Sterk tot erg sterk meer belangrijker"}]
[null,7,{"$f":"\"erg sterk \" &  $G$70","v":"erg sterk meer belangrijker"}]
[null,8,{"$f":"\"sterk tot extreem\" &  $G$70","v":"sterk tot extreemmeer belangrijker"}]
[null,9,{"$f":"\"extreem \" &  $G$70","v":"extreem meer belangrijker"}]
[]
[]
[]
[]
[null,null,null,null,null,null,null,"Genormaliseerde matrix"]
[]
["Matrix 3 Criteria","Matrix",null,{"$f":"+'Definitie Criteria'!$C$15","v":0},{"$f":"+'Definitie Criteria'!$C$16","v":0},{"$f":"+'Definitie Criteria'!$C$17","v":0},null,null,null,null,null,null,null,null,null,null,null,null,null,null,null,null,null,"Criterium",null,"%",null,"Product","Ratio"]
[null,null,{"$f":"+'Definitie Criteria'!$C$15","v":0},{"$f":"+Parameters!C55","v":1},{"$f":"+Parameters!D55","v":5},{"$f":"+Parameters!E55","v":5},null,{"$f":"D90/SUM(D90:D92)","v":0.7142857142857143},{"$f":"E90/SUM(E90:E92)","v":0.80645161290322576},{"$f":"F90/SUM(F90:F92)","v":0.45454545454545453},null,null,null,null,null,null,null,null,null,null,null,null,null,null,{"$f":"+B90","v":0},{"$f":"AVERAGE(H90:J90)","v":0.65842759391146488},null,{"$f":"MMULT(D90:F92,Z90:Z92)","v":2.3662896243541409},{"$f":"AB90/Z90","v":3.5938494167550377}]
[null,null,{"$f":"+'Definitie Criteria'!$C$16","v":0},{"$f":"+Parameters!C56","v":0.2},{"$f":"+Parameters!D56","v":1},{"$f":"+Parameters!E56","v":5},null,{"$f":"D91/SUM(D90:D92)","v":0.14285714285714288},{"$f":"E91/SUM(E90:E92)","v":0.16129032258064516},{"$f":"F91/SUM(F90:F92)","v":0.45454545454545453},null,null,null,null,null,null,null,null,null,null,null,null,null,null,{"$f":"+B91","v":0},{"$f":"AVERAGE(H91:J91)","v":0.25289763999441423},null,0.82795698924731198,{"$f":"AB91/Z91","v":3.2738818332413033}]
[null,null,{"$f":"+'Definitie Criteria'!$C$17","v":0},{"$f":"+Parameters!C57","v":0.2},{"$f":"+Parameters!D57","v":0.2},{"$f":"+Parameters!E57","v":1},null,{"$f":"D92/SUM(D90:D92)","v":0.14285714285714288},{"$f":"E92/SUM(E90:E92)","v":3.2258064516129031E-2},{"$f":"F92/SUM(F90:F92)","v":9.0909090909090912E-2},null,null,null,null,null,null,null,null,null,null,null,null,null,null,{"$f":"+B92","v":0},{"$f":"AVERAGE(H92:J92)","v":8.8674766094120949E-2},null,0.27093981287529678,{"$f":"AB92/Z92","v":3.0554330708661417}]
[null,null,null,null,null,null,null,null,null,null,null,null,null,null,null,null,null,null,null,null,null,null,null,null,null,null,null,"CI=",{"$f":"(AVERAGE(AC90:AC92)-3)/2","v":0.15386072014374719},"CI/RI=",{"$f":"AC93/0.58","v":0.26527710369611585}]
["Matrix 3 Criteria (aangepast)","Optimaal",null,{"$f":"+'Definitie Criteria'!$C$15","v":0},{"$f":"+'Definitie Criteria'!$C$16","v":0},{"$f":"+'Definitie Criteria'!$C$17","v":0},null,null,null,null,null,null,null,null,null,null,null,null,null,null,null,null,null,"Criterium",null,"%",null,"Product","Ratio"]
[null,{"$f":"+'Definitie Criteria'!$C$15","v":0},{"$f":"+'Definitie Criteria'!$C$15","v":0},{"$f":"+C55","v":1},{"$f":"+D55","v":5},{"$f":"+E55","v":5},null,{"$f":"D95/SUM(D95:D97)","v":0.7142857142857143},{"$f":"E95/SUM(E95:E97)","v":0.7142857142857143},{"$f":"F95/SUM(F95:F97)","v":0.7142857142857143},null,null,null,null,null,null,null,null,null,null,null,null,null,null,{"$f":"+B95","v":0},{"$f":"AVERAGE(H95:J95)","v":0.7142857142857143},null,{"$f":"MMULT(D95:F97,Z95:Z97)","v":2.1428571428571423},{"$f":"AB95/Z95","v":2.9999999999999991}]
[null,{"$f":"+'Definitie Criteria'!$C$16","v":0},{"$f":"+'Definitie Criteria'!$C$16","v":0},{"$f":"1/E95","v":0.2},1,{"$f":"+F95/E95","v":1},null,{"$f":"D96/SUM(D95:D97)","v":0.14285714285714288},{"$f":"E96/SUM(E95:E97)","v":0.14285714285714285},{"$f":"F96/SUM(F95:F97)","v":0.14285714285714285},null,null,null,null,null,null,null,null,null,null,null,null,null,null,{"$f":"+B96","v":0},{"$f":"AVERAGE(H96:J96)","v":0.14285714285714285},null,0.42857142857142855,{"$f":"AB96/Z96","v":3}]
[null,{"$f":"+'Definitie Criteria'!$C$17","v":0},{"$f":"+'Definitie Criteria'!$C$17","v":0},{"$f":"1/F95","v":0.2},{"$f":"1/F96","v":1},1,null,{"$f":"D97/SUM(D95:D97)","v":0.14285714285714288},{"$f":"E97/SUM(E95:E97)","v":0.14285714285714285},{"$f":"F97/SUM(F95:F97)","v":0.14285714285714285},null,null,null,null,null,null,null,null,null,null,null,null,null,null,{"$f":"+B97","v":0},{"$f":"AVERAGE(H97:J97)","v":0.14285714285714285},null,0.42857142857142855,{"$f":"AB97/Z97","v":3}]
[null,null,null,null,null,null,null,null,null,null,null,null,null,null,null,null,null,null,null,null,null,null,null,null,null,null,null,"CI=",{"$f":"(AVERAGE(AC95:AC97)-3)/2","v":0},"CI/RI=",{"$f":"AC98/0.58","v":0}]
["Analyse 3","Analyse",null,{"$f":"+Parameters!$E$15","v":0},{"$f":"+Parameters!$E$16","v":0},{"$f":"+Parameters!$E$17","v":0}]
[null,null,{"$f":"+Parameters!$E$15","v":0}," ",{"$f":"ABS((E95-E90)/E95)","v":0},{"$f":"ABS((F95-F90)/F95)","v":0}]
[null,null,{"$f":"+Parameters!$E$16","v":0},null," ",{"$f":"ABS((F96-F91)/F96)","v":4}]
[null,null,{"$f":"+Parameters!$E$17","v":0},null,null," "]
[]
[null,null,null,null,null,null,null,null,"Genormaliseerde matrix"]
["Matrix 4 Criteria","Matrix",null,{"$f":"+'Definitie Criteria'!$C$15","v":0},{"$f":"+'Definitie Criteria'!$C$16","v":0},{"$f":"+'Definitie Criteria'!$C$17","v":0},{"$f":"+'Definitie Criteria'!$C$18","v":0},null,null,null,null,null,null,null,null,null,null,null,null,null,null,null,null,"Criterium",null,"%",null,"Product","Ratio"]
[null,null,{"$f":"+'Definitie Criteria'!$C$15","v":0},{"$f":"+Parameters!C55","v":1},{"$f":"+Parameters!D55","v":5},{"$f":"+Parameters!E55","v":5},{"$f":"+Parameters!F55","v":5},null,{"$f":"D106/SUM(D106:D109)","v":0.625},{"$f":"E106/SUM(E106:E109)","v":0.78125},{"$f":"F106/SUM(F106:F109)","v":0.44642857142857145},{"$f":"G106/SUM(G106:G109)","v":0.3125},null,null,null,null,null,null,null,null,null,null,null,null,{"$f":"+B106","v":0},{"$f":"AVERAGE(I106:L106)","v":0.54129464285714279},null,{"$f":"MMULT(D106:G109,Z106:Z109)","v":2.8348214285714288},{"$f":"AB106/Z106","v":5.2371134020618566}]
[null,null,{"$f":"+'Definitie Criteria'!$C$16","v":0},{"$f":"+Parameters!C56","v":0.2},{"$f":"+Parameters!D56","v":1},{"$f":"+Parameters!E56","v":5},{"$f":"+Parameters!F56","v":5},null,{"$f":"D107/SUM(D106:D109)","v":0.12500000000000003},{"$f":"E107/SUM(E106:E109)","v":0.15625},{"$f":"F107/SUM(F106:F109)","v":0.44642857142857145},{"$f":"G107/SUM(G106:G109)","v":0.3125},null,null,null,null,null,null,null,null,null,null,null,null,{"$f":"+B107","v":0},{"$f":"AVERAGE(I107:L107)","v":0.26004464285714285},null,1.361607142857143,{"$f":"AB107/Z107","v":5.2360515021459237}]
[null,null,{"$f":"+'Definitie Criteria'!$C$17","v":0},{"$f":"+Parameters!C57","v":0.2},{"$f":"+Parameters!D57","v":0.2},{"$f":"+Parameters!E57","v":1},{"$f":"+Parameters!F57","v":5},null,{"$f":"D108/SUM(D106:D109)","v":0.12500000000000003},{"$f":"E108/SUM(E106:E109)","v":3.125E-2},{"$f":"F108/SUM(F106:F109)","v":8.9285714285714288E-2},{"$f":"G108/SUM(G106:G109)","v":0.3125},null,null,null,null,null,null,null,null,null,null,null,null,{"$f":"+B108","v":0},{"$f":"AVERAGE(I108:L108)","v":0.13950892857142858},null,0.59553571428571428,{"$f":"AB108/Z108","v":4.2687999999999997}]
[null,null,{"$f":"+'Definitie Criteria'!$C$18","v":0},{"$f":"+Parameters!C58","v":0.2},{"$f":"+Parameters!D58","v":0.2},{"$f":"+Parameters!E58","v":0.2},{"$f":"+Parameters!F58","v":1},null,{"$f":"D109/SUM(D106:D109)","v":0.12500000000000003},{"$f":"E109/SUM(E106:E109)","v":3.125E-2},{"$f":"F109/SUM(F106:F109)","v":1.785714285714286E-2},{"$f":"G109/SUM(G106:G109)","v":6.25E-2},null,null,null,null,null,null,null,null,null,null,null,null,{"$f":"+B109","v":0},{"$f":"AVERAGE(I109:L109)","v":5.9151785714285719E-2},null,0.24732142857142858,{"$f":"AB109/Z109","v":4.1811320754716981}]
[null,null,null,null,null,null,null,null,null,null,null,null,null,null,null,null,null,null,null,null,null,null,null,null,null,null,null,"CI=",{"$f":"(AVERAGE(AC106:AC109)-4)/3","v":0.24359141497328984},"CI/RI=",{"$f":"AC110/0.9","v":0.2706571277480998}]
["Matrix 4 Criteria (aangepast)","Optimaal",null,{"$f":"+'Definitie Criteria'!$C$15","v":0},{"$f":"+'Definitie Criteria'!$C$16","v":0},{"$f":"+'Definitie Criteria'!$C$17","v":0},{"$f":"+'Definitie Criteria'!$C$18","v":0},null,null,null,null,null,null,null,null,null,null,null,null,null,null,null,null,"Criterium",null,"%",null,"Product","Ratio"]
[null,{"$f":"+'Definitie Criteria'!$C$15","v":0},{"$f":"+'Definitie Criteria'!$C$15","v":0},{"$f":"+C55","v":1},{"$f":"+D55","v":5},{"$f":"+E55","v":5},{"$f":"+F55","v":5},null,{"$f":"D112/SUM(D112:D115)","v":0.625},{"$f":"E112/SUM(E112:E115)","v":0.625},{"$f":"F112/SUM(F112:F115)","v":0.625},{"$f":"G112/SUM(G112:G115)","v":0.625},null,null,null,null,null,null,null,null,null,null,null,null,{"$f":"+B112","v":0},{"$f":"AVERAGE(I112:L112)","v":0.625},null,{"$f":"MMULT(D112:G115,Z112:Z115)","v":2.5},{"$f":"AB112/Z112","v":4}]
[null,{"$f":"+'Definitie Criteria'!$C$16","v":0},{"$f":"+'Definitie Criteria'!$C$16","v":0},{"$f":"1/E112","v":0.2},1,{"$f":"+F112/E112","v":1},{"$f":"+G112/E112","v":1},null,{"$f":"D113/SUM(D112:D115)","v":0.12500000000000003},{"$f":"E113/SUM(E112:E115)","v":0.125},{"$f":"F113/SUM(F112:F115)","v":0.125},{"$f":"G113/SUM(G112:G115)","v":0.125},null,null,null,null,null,null,null,null,null,null,null,null,{"$f":"+B113","v":0},{"$f":"AVERAGE(I113:L113)","v":0.125},null,0.5,{"$f":"AB113/Z113","v":4}]
[null,{"$f":"+'Definitie Criteria'!$C$17","v":0},{"$f":"+'Definitie Criteria'!$C$17","v":0},{"$f":"1/F112","v":0.2},{"$f":"1/F113","v":1},1,{"$f":"+G113/F113","v":1},null,{"$f":"D114/SUM(D112:D115)","v":0.12500000000000003},{"$f":"E114/SUM(E112:E115)","v":0.125},{"$f":"F114/SUM(F112:F115)","v":0.125},{"$f":"G114/SUM(G112:G115)","v":0.125},null,null,null,null,null,null,null,null,null,null,null,null,{"$f":"+B114","v":0},{"$f":"AVERAGE(I114:L114)","v":0.125},null,0.5,{"$f":"AB114/Z114","v":4}]
[null,{"$f":"+'Definitie Criteria'!$C$18","v":0},{"$f":"+'Definitie Criteria'!$C$18","v":0},{"$f":"1/G112","v":0.2},{"$f":"1/G113","v":1},{"$f":"1/G114","v":1},1,null,{"$f":"D115/SUM(D112:D115)","v":0.12500000000000003},{"$f":"E115/SUM(E112:E115)","v":0.125},{"$f":"F115/SUM(F112:F115)","v":0.125},{"$f":"G115/SUM(G112:G115)","v":0.125},null,null,null,null,null,null,null,null,null,null,null,null,{"$f":"+B115","v":0},{"$f":"AVERAGE(I115:L115)","v":0.125},null,0.5,{"$f":"AB115/Z115","v":4}]
[null,null,null,null,null,null,null,null,null,null,null,null,null,null,null,null,null,null,null,null,null,null,null,null,null,null,null,"CI=",{"$f":"(AVERAGE(AC112:AC115)-4)/3","v":0},"CI/RI=",{"$f":"AC116/0.9","v":0}]
["Analyse 4","Analyse",null,{"$f":"+Parameters!$E$15","v":0},{"$f":"+Parameters!$E$16","v":0},{"$f":"+Parameters!$E$17","v":0},{"$f":"+Parameters!$E$18","v":0}]
[null,null,{"$f":"+Parameters!$E$15","v":0}," ",{"$f":"ABS((E112-E106)/E112)","v":0},{"$f":"ABS((F112-F106)/F112)","v":0},{"$f":"ABS((G112-G106)/G112)","v":0}]
[null,null,{"$f":"+Parameters!$E$16","v":0},null," ",{"$f":"ABS((F113-F107)/F113)","v":4},{"$f":"ABS((G113-G107)/G113)","v":4}]
[null,null,{"$f":"+Parameters!$E$17","v":0},null,null," ",{"$f":"ABS((G114-G108)/G114)","v":4}]
{"$rows_left_out":226}
{"sheet":"Grafiek","index":7,"n_rows":47,"n_cols":15,"rows_kept":47,"cut":false,"hidden":false,"merged":[[9,14,9,17],[10,14,10,17]]}
[]
[]
[]
[]
[]
[]
[]
[]
[]
[null,null,null,null,null,null,null,null,null,null,null,null,null,"Nummer:",{"$f":"+Menu!$D$11","v":0}]
[null,null,null,null,null,null,null,null,null,null,null,null,null,"Naam:",{"$f":"+Menu!$D$12","v":0}]
[]
[]
[]
[]
[]
[]
[]
[]
[]
[]
[]
[]
[]
[]
[]
[]
[]
[]
[]
[]
[]
[]
[]
[]
[null,null,null,"Criteria","%",null,"CI/RI"]
[null,null,null,"Prijs",0.59,null,0.2706571277480998]
[null,null,null,"Criteria 1",0.22193080357142855]
[null,null,null,"Criteria 2",0.10661830357142858]
[null,null,null,"Criteria 3",5.7198660714285719E-2]
[null,null,null,"Criteria 4",2.4252232142857148E-2]
[]
[null,"Matrix",null,"Criteria 1","Criteria 2","Criteria 3","Criteria 4"]
[null,null,"Criteria 1",1,5,5,5]
[null,null,"Criteria 2",0.2,1,5,5]
[null,null,"Criteria 3",0.2,0.2,1,5]
[null,null,"Criteria 4",0.2,0.2,0.2,1]

{"sheet":"Analyse","index":8,"n_rows":59,"n_cols":16,"rows_kept":59,"cut":false,"hidden":false,"merged":[[49,1,49,2],[50,1,50,2],[51,1,51,2],[52,1,52,2],[9,14,9,17],[10,14,10,17]]}
[]
[]
[]
[]
[]
[]
[]
[]
[]
[null,null,null,null,null,null,null,null,null,null,null,null,null,"Nummer:",{"$f":"+Menu!$D$11","v":0}]
[null,null,null,null,null,null,null,null,null,null,null,null,null,"Naam:",{"$f":"+Menu!$D$12","v":0}]
[]
[]
[]
[]
[]
[]
[]
[]
[]
[]
[]
[]
[]
[]
[]
[]
[]
[]
[]
[]
[]
[]
[]
[]
[null,null,null,"Criteria","%",null,"CI/RI",null,null,null,null," ","Criteria","%",null,"CI/RI"]
[null,null,null,"Prijs",0.59,null,0.2706571277480998,null,null,null,null,null,"Prijs",0.59,null,0]
[null,null,null,"Criteria 1",0.22193080357142855,null,null,null,null,null,null,null,"Criteria 1",0.25625000000000003]
[null,null,null,"Criteria 2",0.10661830357142858,null,null,null,null,null,null,null,"Criteria 2",5.1250000000000004E-2]
[null,null,null,"Criteria 3",5.7198660714285719E-2,null,null,null,null,null,null,null,"Criteria 3",5.1250000000000004E-2]
[null,null,null,"Criteria 4",2.4252232142857148E-2,null,null,null,null,null,null,null,"Criteria 4",5.1250000000000004E-2]
[]
[null,"Matrix",null,"Criteria 1","Criteria 2","Criteria 3","Criteria 4"]
[null,null,"Criteria 1",1,5,5,5]
[null,null,"Criteria 2",0.2,1,5,5]
[null,null,"Criteria 3",0.2,0.2,1,5]
[null,null,"Criteria 4",0.2,0.2,0.2,1]
[]
[null,"Optimaal",null,"Criteria 1","Criteria 2","Criteria 3","Criteria 4"]
[null,"Criteria 1","Criteria 1",1,5,5,5]
[null,"Criteria 2","Criteria 2",0.2,1,1,1]
[null,"Criteria 3","Criteria 3",0.2,1,1,1]
[null,"Criteria 4","Criteria 4",0.2,1,1,1]
[]
[null,"Analyse",null,"Criteria 1","Criteria 2","Criteria 3","Criteria 4"]
[null,null,"Criteria 1"," ",0,0,0]
[null,null,"Criteria 2",null," ",4,4]
[null,null,"Criteria 3",null,null," ",4]
[null,null,"Criteria 4",null,null,null," "]