{"text_format":"1","workbook":"xlsx","n_sheets":9,"sheets":["Disclaimer","Superformule","Info BD","Evaluatie","TBV Onderzoek","BPK-Grafiek","HULP-velden","DATA","HULP-data"],"not_rendered":{"charts":4,"images":11,"macros":1,"external_links":0,"defined_names":57,"comments":0,"pivot_tables":0},"unopened":[],"bounds":{"document_bytes":16777216,"sheet_cells":100000,"rows_first":2000,"rows_last":500,"rows_between":2000,"halvings":0,"cell_chars":16384,"cell_head_chars":4096},"cells_cut":0,"cells_raw":0,"read":"whole","date_system":"1900"}

{"sheet":"Disclaimer","index":0,"n_rows":22,"n_cols":3,"rows_kept":22,"cut":false,"hidden":false,"merged":[[1,1,3,1]]}
[]
[null,"Disclaimer"]
[]
[]
[]
[]
[]
[]
[]
[]
[]
[]
[]
[]
[]
{"$rows_left_out":8}
{"sheet":"Superformule","index":1,"n_rows":32,"n_cols":23,"rows_kept":32,"cut":false,"hidden":false,"merged":[[5,10,5,11],[6,10,6,11],[1,1,3,2],[10,4,10,6],[11,4,11,6],[5,6,5,7],[6,6,6,7],[10,3,12,3],[19,4,19,8],[9,4,9,8],[13,4,13,6],[14,4,14,8],[20,4,20,8],[12,4,12,6],[18,4,18,8],[15,4,15,6]]}
[]
[null,"Uitgangspunten Superformule"]
[null,null,null,null,"= invoervelden",null,null,null,null,null," "]
[]
[]
[null,null,null,null,"Naam inkooptraject",null,null,null,null,null,"Even geduld a.u.b."]
[null,null,null," ","Kenmerk",null,null,null,null,null,"Updaten van grafieken!"]
[]
[null,null,null,null,"Uitgangspunten Superformule"]
[null,null,null,1,"Maximum aantal punten dat aan de WENSEN wordt toegekend",null,null,null,null,null,100,"= Qwensen"]
[null,null,null,2,"Aandeel Qeisen in KWALITEIT (=100%) (Lijn A)",null,null,null,{"$f":"+'HULP-velden'!J73","v":0.6},null,{"$f":"ROUND(IFERROR(Superformule!K10/Superformule!I12*(1-Superformule!I12),0),0)","v":150}," = Qmin"]
[null,null,null,null,"Aandeel Qwensen in KWALITEIT (=100%)",null,null,null,{"$f":"1-I11","v":0.4},null,{"$f":"IFERROR(+K13-K11,0)","v":100},"= Qwensen"]
[null,null,null,null,"Punten voor EISEN en WENSEN (Qtotaal)",null,null,null,{"$f":"SUM(I11:I12)","v":1},null,{"$f":"IFERROR(+K11+Superformule!K10,0)","v":250}," = Qmax"]
[null,null,null,3,"Referentiekwaliteit (Punt B)",null,null,null,{"$f":"+'HULP-velden'!J74","v":0.5},null,{"$f":"IF(Qmin+I14*(Qmax-Qmin)<'HULP-velden'!J70,'HULP-velden'!J70,Qmin+I14*(Qmax-Qmin))","v":200}," = Qref"]
[null,null,null,4,"Referentieprijs (Pref)",null,null,null,null,null,100000," = Pref"]
{"$rows_left_out":18}
{"sheet":"Info BD","index":2,"n_rows":32,"n_cols":22,"rows_kept":32,"cut":false,"hidden":false,"merged":[[14,6,14,8],[15,6,15,8],[16,6,16,8],[1,1,3,4],[10,6,10,8],[11,6,11,8],[12,6,12,8],[13,6,13,8],[24,3,24,4],[24,9,25,9],[17,6,17,8],[19,6,19,8],[20,6,20,8],[21,6,21,8],[22,6,22,8]]}
[]
[null,"Info t.b.v. Beschrijvend Document",null,null,null,null,null,null,"Even geduld a.u.b. "]
[null,null,null,null,null,null,null,null,"De teksten voor het inkoopdocument worden gegenereerd!"]
[]
[]
[null,null,null,null,null,null,"Voorbeeldtekst en waarden t.b.v. Beschrijvend Document"]
[]
[]
[]
[null,null,null,null,null,null,"Informatie t.b.v. gele velden in tekst Document",null,null,"Waarde"]
[null,null,null,null,null,null,"Totaal aantal punten",null,null,{"$f":"+Qmax","v":250}]
[null,null,null,null,null,null,"Aantal punten voor de wensen (Qwensen)",null,null,{"$f":"Qwensen","v":100}]
[null,null,null,null,null,null,"Aantal punten voor de eisen (Qeisen)",null,null,{"$f":"Qmin","v":150}]
[null,null,null,null,null,null,"Referentie kwaliteit (Qref)",null,null,{"$f":"Qref","v":200}]
[null,null,null,null,null,null,"Referentie Prijs (Pref)",null,null,{"$f":"Pref","v":100000}]
{"$rows_left_out":18}
{"sheet":"Evaluatie","index":3,"n_rows":22,"n_cols":21,"rows_kept":22,"cut":false,"hidden":false,"merged":[[1,1,3,2],[5,9,6,9],[5,13,6,13],[5,12,6,12],[5,11,6,11],[5,7,6,7]]}
[]
[null,{"$f":"\"Evaluatie \"\n& DATA!G46\n& \" \" & DATA!G47","v":"Evaluatie 0 0"}]
[]
[]
[]
[null,null,null,null,"= invoervelden",null,null,"Score \nQwensen",null,"Rang-\norde",null,"Score\nQeisen","Score\nTotaal","Score in procenten"]
[null,null,null,"#","Inschrijver","Qi","Pi",null,"SCOREi"]
[null,null,null,"1",null,{"$f":"+N8","v":""},null,null,{"$f":"IF(ISBLANK(G8),\"\",(0.5*(G8/DATA!$C$12)^DATA!$F$38+0.5*(2-(M8)/DATA!$D$12)^DATA!$F$38)^(1/DATA!$F$38))","v":""},{"$f":"IF('HULP-velden'!K96=\"KO\",\"KO\",'HULP-velden'!O96)","v":""},null,{"$f":"IF(ISBLANK(G8),\"\",DATA!$G$41)","v":""},{"$f":"IFERROR((+H8+L8),\"\")","v":""},{"$f":"IFERROR(((M8/DATA!$G$40)*100),\"\")","v":""}]
[null,null,null,"2",null,"",null,null,{"$f":"IF(ISBLANK(G9),\"\",(0.5*(G9/DATA!$C$12)^DATA!$F$38+0.5*(2-(M9)/DATA!$D$12)^DATA!$F$38)^(1/DATA!$F$38))","v":""},{"$f":"IF('HULP-velden'!K97=\"KO\",\"KO\",'HULP-velden'!O97)","v":""},null,{"$f":"IF(ISBLANK(G9),\"\",DATA!$G$41)","v":""},"",{"$f":"IFERROR(((M9/DATA!$G$40)*100),\"\")","v":""}]
[null,null,null,"3",null,"",null,null,{"$f":"IF(ISBLANK(G10),\"\",(0.5*(G10/DATA!$C$12)^DATA!$F$38+0.5*(2-(M10)/DATA!$D$12)^DATA!$F$38)^(1/DATA!$F$38))","v":""},{"$f":"IF('HULP-velden'!K98=\"KO\",\"KO\",'HULP-velden'!O98)","v":""},null,{"$f":"IF(ISBLANK(G10),\"\",DATA!$G$41)","v":""},"",{"$f":"IFERROR(((M10/DATA!$G$40)*100),\"\")","v":""}]
[null,null,null,"4",null,"",null,null,{"$f":"IF(ISBLANK(G11),\"\",(0.5*(G11/DATA!$C$12)^DATA!$F$38+0.5*(2-(M11)/DATA!$D$12)^DATA!$F$38)^(1/DATA!$F$38))","v":""},{"$f":"IF('HULP-velden'!K99=\"KO\",\"KO\",'HULP-velden'!O99)","v":""},null,{"$f":"IF(ISBLANK(G11),\"\",DATA!$G$41)","v":""},"",{"$f":"IFERROR(((M11/DATA!$G$40)*100),\"\")","v":""}]
[null,null,null,"5",null,"",null,null,{"$f":"IF(ISBLANK(G12),\"\",(0.5*(G12/DATA!$C$12)^DATA!$F$38+0.5*(2-(M12)/DATA!$D$12)^DATA!$F$38)^(1/DATA!$F$38))","v":""},{"$f":"IF('HULP-velden'!K100=\"KO\",\"KO\",'HULP-velden'!O100)","v":""},null,{"$f":"IF(ISBLANK(G12),\"\",DATA!$G$41)","v":""},"",{"$f":"IFERROR(((M12/DATA!$G$40)*100),\"\")","v":""}]
[null,null,null,"6",null,"",null,null,{"$f":"IF(ISBLANK(G13),\"\",(0.5*(G13/DATA!$C$12)^DATA!$F$38+0.5*(2-(M13)/DATA!$D$12)^DATA!$F$38)^(1/DATA!$F$38))","v":""},{"$f":"IF('HULP-velden'!K101=\"KO\",\"KO\",'HULP-velden'!O101)","v":""},null,{"$f":"IF(ISBLANK(G13),\"\",DATA!$G$41)","v":""},"",{"$f":"IFERROR(((M13/DATA!$G$40)*100),\"\")","v":""}]
[null,null,null,"7",null,"",null,null,{"$f":"IF(ISBLANK(G14),\"\",(0.5*(G14/DATA!$C$12)^DATA!$F$38+0.5*(2-(M14)/DATA!$D$12)^DATA!$F$38)^(1/DATA!$F$38))","v":""},{"$f":"IF('HULP-velden'!K102=\"KO\",\"KO\",'HULP-velden'!O102)","v":""},null,{"$f":"IF(ISBLANK(G14),\"\",DATA!$G$41)","v":""},"",{"$f":"IFERROR(((M14/DATA!$G$40)*100),\"\")","v":""}]
[null,null,null,"8",null,"",null,null,{"$f":"IF(ISBLANK(G15),\"\",(0.5*(G15/DATA!$C$12)^DATA!$F$38+0.5*(2-(M15)/DATA!$D$12)^DATA!$F$38)^(1/DATA!$F$38))","v":""},{"$f":"IF('HULP-velden'!K103=\"KO\",\"KO\",'HULP-velden'!O103)","v":""},null,{"$f":"IF(ISBLANK(G15),\"\",DATA!$G$41)","v":""},"",{"$f":"IFERROR(((M15/DATA!$G$40)*100),\"\")","v":""}]
{"$rows_left_out":8}
{"sheet":"TBV Onderzoek","index":4,"n_rows":28,"n_cols":20,"rows_kept":28,"cut":false,"hidden":false,"merged":[[1,1,3,7],[5,3,5,4],[11,4,11,6],[8,3,8,4],[12,15,13,15]]}
[]
[null,"Data voor onderzoek Superformule"]
[]
[]
[]
[null,"Naam inkooptraject",null,"Naam traject"]
[null,"Kenmerk",null,"Uw kenmerk"]
[]
[null,"Naam organisatie",null,"Uw organisatie"]
[null,"Datum Publicatie",null,"2021-11-11"]
[null,"CPV-code",null,"ICT"]
[]
[null,"Contactpersoon",null,"uw naam",null,null,null,null,null,null,null,null,null,null,null,"Namen van inschrijvers geanonimiseerd"]
[null,"Telefoonnummer",null,"uw telefoonnr."]
[]
{"$rows_left_out":14}
{"sheet":"BPK-Grafiek","index":5,"n_rows":83,"n_cols":16,"rows_kept":83,"cut":false,"hidden":true,"merged":[[19,3,19,4],[18,3,18,4],[17,3,17,4],[20,3,20,4],[21,3,21,4],[10,3,10,4],[8,3,8,4],[10,6,10,7],[17,6,17,7],[14,3,14,4],[12,3,12,4],[11,3,11,4]]}
[]
[null,"Europese Aanbesteding"]
[null,{"$f":"Superformule!G6","v":0}]
[null,"BPK-Grafiek"]
[null,{"$f":"\"Kenmerk: \" & Superformule!G7","v":"Kenmerk: "}]
[null,"(Prijzen exclusief BTW)"]
[]
[]
[null,null,null,"Vergelijkingswaarde"]
[]
[null,null,null,"      Indicatie eigen score",null,"Score Kwaliteit","Procenten"]
[null,null,null,"Kwaliteit in eisen ",null,{"$f":"+DATA!G41","v":150},{"$f":"+F12/DATA!$G$40*100","v":60},"%"]
[null,null,null,"Eigen inschatting score kwaliteit *1",null,null,{"$f":"+F13/DATA!$G$40*100","v":0},"%"]
[null,null,null,null,"Totaal kwaliteit",{"$f":"SUM(F12:F13)","v":150},{"$f":"SUM(G12:G13)","v":60},"%"]
[null,null,null,"Indicatie BPK-score",null,{"$f":"+DATA!E7","v":0.88388347648318444}]
{"$rows_left_out":69}
{"sheet":"HULP-velden","index":6,"n_rows":1012,"n_cols":64,"rows_kept":1012,"cut":false,"hidden":true,"merged":[[118,6,118,7],[79,7,79,8],[0,2,2,3],[76,7,76,8],[77,7,77,8],[78,7,78,8],[70,7,70,8],[71,7,71,8],[72,7,72,8],[73,7,73,8],[74,7,74,8],[18,6,18,10],[19,6,19,10],[69,7,69,8]]}
[null,null,"Hulpvelden"]
[]
[]
[]
[]
[null,null,"Oplossen n=waarde (Solver)",null,null,null,null,null,null,null,null,null,null,"EMVI-lijnen t.b.v grafiek",null,null,null,null,null,null,null,null,null,null,null,null,null,null,null,null,null,null,null,null,null,null,null,"Qmax",null,null,null,null,null,null,null,null,null,null,null,null,null,null,null,null,null,null,null,"Nummerieke waarden naar tekst"]
[null,null,null,null,null,null,null,null,null,null,null,null,null,null,"hulp=Q bij P=0",0,{"$f":"+R7/2","v":1.2500000000000001E-2},{"$f":"+S7/2","v":2.5000000000000001E-2},0.05,0.1,0.15,0.2,0.25,0.3,0.35,0.4,0.45,0.5,0.55000000000000004,0.6,0.65,0.7,0.75,0.8,0.85,0.9,0.95,1,1.05,1.1000000000000001,1.1499999999999999,1.2,1.25,1.3,1.35,1.4,1.45,1.5,1.55,1.6,1.65,1.7,1.75,1.8]
[null,null,"Pmax/Pref",{"$f":"'HULP-velden'!K75","v":1.1989578808281798},{"$f":"VLOOKUP(TRUE,$C:$E,3,TRUE)","v":2.0000620863460412},null,null,null,null,null,null,null,null,"Q berekend bij P=0 en EMVI=1",{"$f":"'HULP-velden'!L18","v":117.15728752538097},{"$f":"IFERROR($O8+P$7*(Qmax-$O8),0)","v":117.15728752538097},{"$f":"IFERROR($O8+Q$7*(Qmax-$O8),0)","v":118.8178214313137},120.47835533724644,123.79942314911192,130.44155877284288,137.08369439657383,143.72583002030478,150.36796564403573,157.01010126776669,163.65223689149764,170.29437251522859,176.93650813895954,183.57864376269049,190.22077938642144,196.86291501015239,203.50505063388334,210.14718625761429,216.78932188134524,223.4314575050762,230.07359312880715,236.7157287525381,243.35786437626905,250,256.64213562373095,263.2842712474619,269.92640687119285,276.5685424949238,null,null,null,null,null,null,null,null,null,null,null,null,"EMVI",null,null,"Qmax",{"$f":"Qmax","v":250},{"$f":"TEXT(BG8,\"#.##0\")","v":"250"},null,"Winnaar",{"$f":"I61","v":"4"},{"$f":"TEXT(BK8,\"#.##0\")","v":"4"}]
[null,null,"Q/Qref",{"$f":"+'HULP-velden'!L17","v":1.25},null,null,null,null,null,null,null,null,null,"P berekend uit Q en EMVI=1",null,0,{"$f":"IFERROR((2*$BC$9^Exponent-(2-Q8/Qref)^Exponent)^(1/Exponent)*Pref,0)","v":15301.817337880153},{"$f":"IFERROR((2*$BC$9^Exponent-(2-R8/Qref)^Exponent)^(1/Exponent)*Pref,0)","v":21608.159136246002},30468.185650103391,42831.783651820129,52141.672987749946,59840.516795099422,66490.314000053171,72380.77975902686,77684.835833010613,82515.642004754831,86952.111243430321,91051.90355561435,94858.682521369032,98406.45901289639,101722.33637899699,104828.3228832969,107742.57216080221,110480.25819260458,113054.20851061429,115475.37265926583,117753.17548503382,119895.78808281798,{"$f":"IFERROR((2*$BC$9^Exponent-(2-AM8/Qref)^Exponent)^(1/Exponent)*Pref,0)","v":121910.33869352021},{"$f":"IFERROR((2*$BC$9^Exponent-(2-AN8/Qref)^Exponent)^(1/Exponent)*Pref,0)","v":123803.07903245219},{"$f":"IFERROR((2*$BC$9^Exponent-(2-AO8/Qref)^Exponent)^(1/Exponent)*Pref,0)","v":125579.51701069878},{"$f":"IFERROR((2*$BC$9^Exponent-(2-AP8/Qref)^Exponent)^(1/Exponent)*Pref,0)","v":127244.52375070271},null,null,null,null,null,null,null,null,null,null,null,null,{"$f":"IFERROR('HULP-velden'!H25,0)","v":1},null,null,"Qmin",{"$f":"Qmin","v":150},{"$f":"TEXT(BG9,\"#.##0\")","v":"150"},null,"Prijs winnaar",{"$f":"VLOOKUP($BK$8,'Info BD'!$B$27:$K$31,4,FALSE)","v":92040},{"$f":"TEXT(BK9,\"€ #.##0,00\")","v":"€ 92.040,00"}]
[null,null,"n",{"$f":"ROUNDDOWN(VLOOKUP(TRUE,$C:$E,3,TRUE),4)","v":2},{"$f":"VLOOKUP(TRUE,$C:$E,2,TRUE)","v":1},null,null,null,null,null,null,null,null,null,null,{"$f":"+P8/Qmax*100","v":46.862915010152385},47.527128572525477,48.191342134898576,49.519769259644768,52.176623509137151,54.833477758629535,57.490332008121911,60.147186257614294,62.80404050710667,65.460894756599046,68.117749006091429,70.774603255583813,73.431457505076196,76.088311754568565,78.745166004060948,81.402020253553346,84.058874503045729,86.715728752538098,89.372583002030481,92.029437251522864,94.686291501015234,97.343145750507617,100,{"$f":"+AM8/Qmax*100","v":102.65685424949238},{"$f":"+AN8/Qmax*100","v":105.31370849898477},{"$f":"+AO8/Qmax*100","v":107.97056274847714},{"$f":"+AP8/Qmax*100","v":110.62741699796952},null,null,null,null,null,null,null,null,null,null,null,null,null,null,null,"Qwensen",{"$f":"Qwensen","v":100},{"$f":"TEXT(BG10,\"#.##0\")","v":"100"},null,"Q-score",{"$f":"VLOOKUP($BK$8,'Info BD'!$B$27:$K$31,8,FALSE)","v":235},{"$f":"TEXT(BK10,\"#.##0\")","v":"235"}]
[null,null,null,null,null,null,null,null,null,null,null,null,null,"Q berekend bij P=0 en EMVI=0,9",{"$f":"IFERROR(Qref*(2-BC12*(2-'HULP-velden'!H$24/Qref)),0)","v":145.44155877284285},{"$f":"IFERROR($O11+P$7*(Qmax-$O11),0)","v":145.44155877284285},146.74853928818231,148.05551980352178,150.6694808342007,155.89740289555857,161.12532495691642,166.35324701827429,171.58116907963213,176.80909114099001,182.03701320234785,187.26493526370572,192.49285732506357,197.72077938642144,202.94870144777929,208.17662350913713,213.404545570495,218.63246763185285,223.86038969321072,229.08831175456856,234.31623381592641,239.54415587728428,244.77207793864216,250,255.22792206135784,260.45584412271569,265.68376618407353,270.91168824543144,276.13961030678928,null,null,null,null,null,null,null,null,null,null,null,"EMVI",null,null,"Pref",{"$f":"Pref","v":100000},{"$f":"TEXT(BG11,\"€ #.##0,00\")","v":"€ 100.000,00"},null,"BPK-Score",{"$f":"VLOOKUP(1,$G$130:$K$134,5,FALSE)","v":0.87400262013337238},{"$f":"TEXT(BK11,\"#.##0,0000\")","v":"0,8740"}]
[null,null,"Opgelost","Waarde=1","n",null,null,null,null,null,null,null,null,"P berekend uit Q en EMVI=0,9",null,0,{"$f":"IFERROR((2*$BC$12^Exponent-(2-Q11/Qref)^Exponent)^(1/Exponent)*Pref,0)","v":12881.165002928316},{"$f":"IFERROR((2*$BC$12^Exponent-(2-R11/Qref)^Exponent)^(1/Exponent)*Pref,0)","v":18193.260417847021},25662.678214252082,36103.746643758241,43985.4794877276,50520.280138515802,56180.151479353422,61208.288251447426,65749.784003916153,69899.556922137737,73723.784728680999,77270.817434467477,80577.269963190585,83671.668191277087,86576.75263349645,89310.999046434794,91889.658940726862,94325.493400639651,96629.304073688269,98810.32598730101,100876.52379581808,102834.81900601568,{"$f":"IFERROR((2*$BC$12^Exponent-(2-AM11/Qref)^Exponent)^(1/Exponent)*Pref,0)","v":104691.26688665073},{"$f":"IFERROR((2*$BC$12^Exponent-(2-AN11/Qref)^Exponent)^(1/Exponent)*Pref,0)","v":106451.19604834905},{"$f":"IFERROR((2*$BC$12^Exponent-(2-AO11/Qref)^Exponent)^(1/Exponent)*Pref,0)","v":108119.31988953844},{"$f":"IFERROR((2*$BC$12^Exponent-(2-AP11/Qref)^Exponent)^(1/Exponent)*Pref,0)","v":109699.82653627504},{"$f":"IFERROR((2*$BC$12^Exponent-(2-AQ11/Qref)^Exponent)^(1/Exponent)*Pref,0)","v":111196.45212982965},null,null,null,null,null,null,null,null,null,null,null,{"$f":"0.9*BC9","v":0.9},null,null,"Qref",{"$f":"Qref","v":200},{"$f":"TEXT(BG12,\"#.##0\")","v":"200"},null,"Nummer 2",{"$f":"VLOOKUP(2,$G$130:$K$134,5,FALSE)","v":0.89895077729539785},{"$f":"TEXT(BK12,\"#.##0,0000\")","v":"0,8990"}]
[null,1,{"$f":"IF(AND(D13<=1,D13>=0.9995),TRUE,FALSE)","v":false},{"$f":"ROUNDDOWN((0.5*A^E13+0.5*(2-B)^E13)^(1/E13),4)","v":0.97440000000000004},1,null,null,null,null,null,null,null,null,null,null,{"$f":"+P11/Qmax*100","v":58.176623509137137},58.699415715272927,59.22220792140871,60.267792333680283,62.358961158223423,64.450129982766569,66.541298807309715,68.632467631852862,70.723636456395994,72.81480528093914,74.905974105482287,76.997142930025433,79.088311754568579,81.179480579111711,83.270649403654858,85.361818228198004,87.452987052741136,89.544155877284297,91.635324701827429,93.726493526370575,95.817662350913707,97.908831175456868,100,{"$f":"+AM11/Qmax*100","v":102.09116882454315},{"$f":"+AN11/Qmax*100","v":104.18233764908626},{"$f":"+AO11/Qmax*100","v":106.27350647362941},{"$f":"+AP11/Qmax*100","v":108.36467529817257},{"$f":"+AQ11/Qmax*100","v":110.45584412271572},null,null,null,null,null,null,null,null,null,null,null,null,null,null,"Qref punten",{"$f":"Qref-Qmin","v":50},{"$f":"TEXT(BG13,\"#.##0\")","v":"50"},null,"Nummer 5",{"$f":"VLOOKUP(G135,$G$130:$K$134,5,FALSE)","v":0.93880136610467291},{"$f":"TEXT(BK13,\"#.##0,0000\")","v":"0,9388"}]
[null,2,{"$f":"IF(AND(D14<=1,D14>=0.9995),TRUE,FALSE)","v":false},{"$f":"ROUNDDOWN((0.5*A^E14+0.5*(2-B)^E14)^(1/E14),4)","v":0.97509999999999997},{"$f":"IF(D13=1,E13,E13/(D13^E13))","v":1.0262725779967159},null,null,null,null,null,null,null,null,"Q berekend bij P=0 en EMVI=0,8",{"$f":"IFERROR(Qref*(2-BC15*(2-'HULP-velden'!H$24/Qref)),0)","v":173.72583002030476},{"$f":"IFERROR($O14+P$7*(Qmax-$O14),0)","v":173.72583002030476},174.67925714505094,175.63268426979712,177.53953851928952,181.35324701827429,185.16695551725905,188.98066401624379,192.79437251522856,196.60808101421333,200.42178951319809,204.23549801218286,208.04920651116763,211.86291501015239,215.67662350913713,219.4903320081219,223.30404050710666,227.11774900609143,230.9314575050762,234.74516600406096,238.55887450304573,242.37258300203047,246.18629150101523,250,253.81370849898477,257.62741699796953,261.44112549695427,265.25483399593907,269.0685424949238,272.88225099390854,null,null,null,null,null,null,null,null,null,null,"EMVI",null,null,"Exponent",{"$f":"Exponent","v":2},{"$f":"TEXT(BG14,\"#.##0,0000\")","v":"2,0000"},null,"LAQ",{"$f":"LAQ","v":-1000},{"$f":"TEXT(BK14,\"#.##0\")","v":"-1.000"}]
[null,3,false,0.9758,{"$f":"IF(D14=1,E14,E14/(D14^E14))","v":1.0531767794364724},null,"Hulpvelden",null,null,null,null,null,null,"P berekend uit Q en EMVI=0,8",null,0,{"$f":"IFERROR((2*$BC$15^Exponent-(2-Q14/Qref)^Exponent)^(1/Exponent)*Pref,0)","v":10375.004087877855},{"$f":"IFERROR((2*$BC$15^Exponent-(2-R14/Qref)^Exponent)^(1/Exponent)*Pref,0)","v":14656.974722154282},20684.191293046271,29127.295662952594,35520.286451113658,40837.604731958207,45458.299403525169,49577.53344832515,53311.67296869844,56736.804107787808,59905.953124475927,62857.850049780718,65621.819692476594,68220.707562773692,70672.727941699355,72992.683351277083,75192.798755336509,77283.309713311712,79272.887859401002,81168.955596564498,82977.923385966584,84705.371730487095,{"$f":"IFERROR((2*$BC$15^Exponent-(2-AM14/Qref)^Exponent)^(1/Exponent)*Pref,0)","v":86356.192854334717},87934.70249186318,89444.729157800626,90889.686211552733,92272.630605717059,93596.311208861676,null,null,null,null,null,null,null,null,null,null,{"$f":"0.8*BC9","v":0.8},null,null,null,null,null,null,"Delta LAQ",{"$f":"+BK14-BG9","v":-1150},{"$f":"TEXT(BK15,\"#.##0\")","v":"-1.150"}]
{"$rows_left_out":998}
{"sheet":"DATA","index":7,"n_rows":47,"n_cols":27,"rows_kept":47,"cut":false,"hidden":true,"merged":[[1,1,3,4],[8,2,9,9]]}
[]
[null,"Hulpdata Grafiek Superformule"]
[]
[]
[]
[null,"Hulpvelden"]
[null,"Uw inschrijving",{"$f":"+'BPK-Grafiek'!$F$9","v":0},{"$f":"+'BPK-Grafiek'!$F$14","v":150},{"$f":"IFERROR((0.5*($C$7/$G$38)^$F$38+0.5*(2-$D$7/$H$38)^$F$38)^(1/$F$38),0)","v":0.88388347648318444},{"$f":"+D7/G40*100","v":60}]
[]
[null,"LET OP  !!!","Voordat de TAB-bladen \"TBV PRIJSMODEL (1)\" EN \"TBV PRIJSMODEL (2)\" gekopieerd worden kan naar het Prijsmodel, moeten eerst onderstaande waarden ( oranje velden ) worden geselecteerd en worden gekopieerd en geplakt worden als WAARDEN (ctrl-C, plakken speciaal \"waarden\")"]
[]
[null,"EVMI-punten","P ","Q","EMVI"]
[null,"Ref",{"$f":"$G$38","v":100000},{"$f":"$H$38","v":200},{"$f":"IFERROR((0.5*($C$12/$G$38)^$F$38+0.5*(2-$D$12/$H$38)^$F$38)^(1/$F$38),0)","v":1}]
[null,"Ref (boven)",{"$f":"+'HULP-velden'!$J$23","v":119895.78808281798},{"$f":"$G$40","v":250},{"$f":"IFERROR((0.5*($C$13/$G$38)^$F$38+0.5*(2-$D$13/$H$38)^$F$38)^(1/$F$38),0)","v":1}]
[null,"Ref (onder)",0,{"$f":"'HULP-velden'!$L$18","v":117.15728752538097},{"$f":"IFERROR((0.5*(C14/$G$38)^$F$38+0.5*(2-D14/$H$38)^$F$38)^(1/$F$38),0)","v":1}]
[]
{"$rows_left_out":33}
{"sheet":"HULP-data","index":8,"n_rows":47,"n_cols":27,"rows_kept":47,"cut":false,"hidden":true,"merged":[[1,1,3,4],[8,2,9,9]]}
[]
[null,"Hulpdata Grafiek Superformule"]
[]
[]
[]
[null,"Hulpvelden"]
[null,"Uw inschrijving",{"$f":"+'BPK-Grafiek'!$F$9","v":0},{"$f":"+'BPK-Grafiek'!$F$14","v":150},{"$f":"IFERROR((0.5*($C$7/$G$38)^$F$38+0.5*(2-$D$7/$H$38)^$F$38)^(1/$F$38),0)","v":0.88388347648318444},{"$f":"+D7/G40*100","v":60}]
[]
[null,"LET OP  !!!","Voordat de TAB-bladen \"TBV PRIJSMODEL (1)\" EN \"TBV PRIJSMODEL (2)\" gekopieerd worden kan naar het Prijsmodel, moeten eerst onderstaande waarden ( oranje velden ) worden geselecteerd en worden gekopieerd en geplakt worden als WAARDEN (ctrl-C, plakken speciaal \"waarden\")"]
[]
[null,"EVMI-punten","P ","Q","EMVI"]
[null,"Ref",{"$f":"$G$38","v":100000},{"$f":"$H$38","v":200},{"$f":"IFERROR((0.5*($C$12/$G$38)^$F$38+0.5*(2-$D$12/$H$38)^$F$38)^(1/$F$38),0)","v":1}]
[null,"Ref (boven)",{"$f":"+'HULP-velden'!$J$23","v":119895.78808281798},{"$f":"$G$40","v":250},{"$f":"IFERROR((0.5*($C$13/$G$38)^$F$38+0.5*(2-$D$13/$H$38)^$F$38)^(1/$F$38),0)","v":1}]
[null,"Ref (onder)",0,{"$f":"'HULP-velden'!$L$18","v":117.15728752538097},{"$f":"IFERROR((0.5*(C14/$G$38)^$F$38+0.5*(2-D14/$H$38)^$F$38)^(1/$F$38),0)","v":1}]
[]
{"$rows_left_out":32}