{"text_format":"1","workbook":"xlsx","n_sheets":11,"sheets":["Disclaimer","Dashboard","Scoregraph Prijs","Info BD","Scenarioanalyse","Evaluatie","TBV Onderzoek","HULP-velden","BPK-Grafiek","DATA","DATA-hulp"],"not_rendered":{"charts":7,"images":13,"macros":1,"external_links":0,"defined_names":62,"comments":0,"pivot_tables":0},"unopened":[],"bounds":{"document_bytes":16777216,"sheet_cells":100000,"rows_first":2000,"rows_last":500,"rows_between":2000,"halvings":0,"cell_chars":16384,"cell_head_chars":4096},"cells_cut":0,"cells_raw":0,"read":"whole","date_system":"1900"}

{"sheet":"Disclaimer","index":0,"n_rows":22,"n_cols":7,"rows_kept":22,"cut":false,"hidden":false,"merged":[[11,1,11,6],[13,1,13,6],[14,1,14,6],[1,1,3,3],[6,1,7,6],[8,1,8,6],[9,1,9,6],[10,1,10,6],[20,4,20,5],[21,4,21,5],[17,1,17,4],[12,1,12,6],[19,4,19,5],[15,1,16,6],[19,6,19,7],[20,6,20,7],[21,6,21,7]]}
[]
[null,"Disclaimer"]
[]
[]
[null,"Disclaimer Excel-tool, presentatie en handleiding ten behoeve van het gebruik van de Tool Gewogen Factor Methode."]
[]
[null,"• Deze Excel-tool, inclusief de daarbij behorende presentatie en handleiding, ten behoeve van het gebruik van de gunningsmethodiek Gewogen\n    Factor Methode bij (Europese) aanbestedingen en (nadere) offerteaanvragen (hierna gezamenlijk te noemen de ‘Excel-tool’), is ontwikkeld door het \n    Inkoopuitvoeringscentrum (IUC) Belastingdienst en wordt u kosteloos ter beschikking gesteld."]
[]
[null,"• Deze Excel-tool mag vrij gebruikt worden, zoals deze wordt aangeboden door het IUC Belastingdienst. Het is derhalve niet toegestaan om\n    inhoudelijke wijzigingen aan te brengen in de Excel-tool. "]
[null,"• Het intellectuele eigendomsrecht op deze Excel-tool berust bij het IUC Belastingdienst. Aanwezige aanduidingen van copyright mogen niet\n   worden verwijderd. "]
[null,"• Het IUC Belastingdienst behoudt zich te allen tijde het recht voor om de Excel-tool te wijzigen."]
[null,"• Het IUC Belastingdienst kan niet garanderen dat deze Excel-tool foutloos en ononderbroken functioneert; wel doen wij daarvoor ons uiterste\n   best. "]
[null,"• De Excel-tool maakt gebruik van macro’s die zijn geschreven in VBA. Voor instructies over het inschakelen en gebruiken van deze macro’s, zie hoofdstuk 3\n   van de handleiding. Let op: Zonder het activeren van VBA-macro’s functioneert de Excel-tool niet correct!"]
[null,"• Het gebruik van deze Excel-tool geschiedt geheel voor eigen rekening en risico. "]
[null,"• Het IUC Belastingdienst aanvaardt geen aansprakelijkheid voor schade, van welke aard ook, die uit het gebruik van deze Excel-tool zou kunnen\n   voortvloeien."]
[null,"• U kunt contact met ons opnemen indien u vragen heeft over het gebruik, de werkwijze en/of als u tegen (technische) problemen aanloopt bij\n   het gebruik van deze Excel-tool. Dit geldt ook voor wijzigingsverzoeken. De contactgegevens staan hieronder en in de handleiding bij de\n   Excel-tool. "]
[]
[null,"• De actuele versie van de Tool Gewogen Factor Methode is te downloaden via"]
[]
[null,null,null,null,"© 2021-2025",null,"© 2021-2025"]
[null,null,null,null,"IUC-Belastingdienst",null,"IUC-Belastingdienst"]
[null,null,null,null,"procurement.economics@belastingdienst.nl",null,"Versie 10-2025"]

{"sheet":"Dashboard","index":1,"n_rows":30,"n_cols":22,"rows_kept":30,"cut":false,"hidden":false,"merged":[[1,1,3,1],[19,3,19,5],[15,3,15,5],[17,3,17,5],[12,3,12,5],[11,3,11,6],[14,3,14,5],[18,3,18,4],[13,3,13,5],[10,3,10,5],[6,5,6,6],[5,5,5,6],[9,3,9,6]]}
[]
[null,{"$f":"\"Uitgangspunten Gewogen Factor Methode\"","v":"Uitgangspunten Gewogen Factor Methode"}]
[null,null,null,"= invoervelden",null,null,null," "]
[]
[]
[null,null,null,"Naam inkooptraject"," ","Formule voor prijs"]
[null,null,null,"Kenmerk"," ","Machtsformule"]
[]
[null,null,null,"Uitgangspunten voor de Gewogen Factor Methode"]
[null,null,1,"Totaal aantal punten dat aan de wensen wordt toegekend.",null,null,null,500,null," = SQwensen"]
[null,null,null,"Totaal aantal punten dat aan de prijs wordt toegekend.",null,null,null,{"$f":"(H10/H12)*H13","v":500},null," = SPmax",{"$f":"IF(ISERROR(H11),1,IF(H11<>ROUND(H11,0),1,0))","v":0}]
[null,null,2,"Gewicht voor het aandeel van de kwaliteit (gunningscriteria).",null,null,null,0.5,null," = Wq"]
[null,null,null,"Gewicht voor het aandeel van de prijs.",null,null,null,{"$f":"1-H12","v":0.5},null," = Wp"]
[null,null,3,"Hoogst verwachte vergelijkingswaarde (wensen maximaal ingevuld).",null,null,null,500000,{"$f":"IF(H14<=H15,\"!\",\"\")","v":""}," = Pmax"]
[null,null,4,"Laagste verwachte vergelijkingswaarde (geen invulling van wensen).",null,null,null,300000,{"$f":"IF(H15>=H14,\"!\",\"\")","v":""}," = Pmin"]
[null,null,5,"Exponentwaarde voor kromming prijs.",null,null,null,1,null," = n"]
[null,null,null,"Voorbeeldinschrijving (vbi)"]
[null,null,"A","Voorbeeldprijs (Pvbi).",null,null,null,400000,{"$f":"IF(OR(H18<=H15,H18>=H14),\"!\",\"\")","v":""}," = Pvbi"]
[null,null,"B","Voorbeeldkwaliteit Qvbi | in % van SQmax = 500",null,null,0.5,{"$f":"+G19*H10","v":250},null," = SQvbi"]
[null,null,null,"Indicatie BPK-score van Voorbeeldinschrijving (Pvbi, Qvbi).",null,null,null,{"$f":"+'HULP-velden'!M16","v":500},null," = Svbi"]
[null,null,null,"Optioneel"]
[null,null,"X",{"$f":"\"Lowest Acceptable Quality (maximaal \" & 0.4*H10 & \" punten van SQmax)\"","v":"Lowest Acceptable Quality (maximaal 200 punten van SQmax)"},null,null,{"$f":"0.4*H10","v":200},null,null," = Qknockout"]
[null,null,"Y","Scenarioanalyse tonen (zie ook tabblad \"Scenarioanalyse\").",null,null,"Nee",{"$f":"IF(G23=\"Ja\",\"Zichtbaar\",\"Onzichtbaar\")","v":"Onzichtbaar"}]
[]
[]
[]
[]
[]
[]
[null,null,null,null,null,null,null,null,null,null,null,null,null,null,null,null,null,null,null,null,null," "]

{"sheet":"Scoregraph Prijs","index":2,"n_rows":32,"n_cols":22,"rows_kept":32,"cut":false,"hidden":false,"merged":[[20,3,21,7],[18,3,18,4],[11,3,11,6],[12,3,12,5],[9,3,9,5],[10,3,10,5],[15,3,15,5],[17,3,17,5],[1,1,3,1],[14,3,14,5],[13,3,13,5],[6,5,6,6],[5,5,5,6]]}
[]
[null,"Scoregraph voor Prijs"]
[null,null,null,null,null,null,null," "]
[]
[]
[null,null,null,"Naam inkooptraject",{"$f":"IF(ISBLANK(Dashboard!E6),\"\",Dashboard!E6)","v":" "},"Formule voor prijs"]
[null,null,null,"Kenmerk",{"$f":"IF(ISBLANK(Dashboard!E7),\"\",Dashboard!E7)","v":" "},{"$f":"Dashboard!F7","v":"Machtsformule"}]
[]
[null,null,null,"Uitgangspunten voor Gewogen Factor Methode"]
[null,null,1,"Totaal aantal punten dat aan de wensen wordt toegekend.",null,null,null,{"$f":"+Dashboard!H10","v":500},null," = SQmax"]
[null,null,null,"Totaal aantal punten dat aan de prijs wordt toegekend.",null,null,null,{"$f":"+Dashboard!H11","v":500},null," = SPmax"]
[null,null,2,"Gewicht voor het aandeel van de kwaliteit (gunningscriteria).",null,null,null,{"$f":"+Dashboard!H12","v":0.5},null," = Wq"]
[null,null,null,"Gewicht voor het aandeel van de prijs.",null,null,null,{"$f":"+Dashboard!H13","v":0.5},null," = Wp"]
[null,null,3,"Hoogst verwachte vergelijkingswaarde (wensen maximaal ingevuld).",null,null,null,{"$f":"+Dashboard!H14","v":500000},null," = Pmax"]
[null,null,4,"Laagste verwachte vergelijkingswaarde (geen invulling van wensen).",null,null,null,{"$f":"+Dashboard!H15","v":300000},null," = Pmin"]
[null,null,5,"Exponentiële voor n=waarde.",null,null,null,{"$f":"+Dashboard!H16","v":1},null," = n"]
[null,null,null,"Voorbeeld inschrijving"]
[null,null,"A","Voorbeeldprijs inschrijver (Pvbi).",null,null,null,{"$f":"+Dashboard!H18","v":400000},null," = Pvbi"]
[null,null,"B","Voorbeeld score inschrijver (SPvbi).",null,null,null,{"$f":"+'HULP-velden'!C164","v":250},null," = SPvbi"]
[]
[null,null,"NB","Bij stap 5 op het ‘Dashboard’ kunt u de kromming van de scoregrafiek voor prijs aanpassen. \nDe kromming staat voor een afnemende meerwaarde van extra kwaliteitspunten. Een waarde van 1 resulteert in een lineair verloop van kwaliteitswaarde, terwijl een hogere n-waarde de meerwaarde laat afnemen cq. een kromming geeft. "]
[]
[]
[]
[]
[]
[]
[]
[]
[]
[]
[null,null,null,null,null,null,null,null,null,null,null,null,null,null,null,null,null,null,null,null,null," "]

{"sheet":"Info BD","index":3,"n_rows":32,"n_cols":23,"rows_kept":32,"cut":false,"hidden":false,"merged":[[1,1,3,3],[16,8,16,9],[9,3,9,5],[10,3,10,5],[11,3,11,5],[6,3,6,5],[8,3,8,5],[7,3,7,5],[12,3,12,5],[13,3,13,5],[14,3,14,5],[6,1,8,1]]}
[]
[null,"Informatie voor Beschrijvend Document"]
[]
[]
[]
[null,null,null,"Uitgangspunten",null,null,null,"Waarde","Voorbeeld (winnaar)",null,null,"Waarde"]
[null,"Tekst voor het beschrijvend document wordt gegenereerd. Even geduld a.u.b.",null,"Aantal punten voor de wensen (Qwensen)",null,null,null,{"$f":"+'HULP-velden'!C6","v":500},"Winnaar ",null,null,{"$f":"IF(ISERROR(VLOOKUP(1,C$19:L$23,2,FALSE)),\"geen\",VLOOKUP(1,C$19:L$23,2,FALSE))","v":"4"}]
[null,null,null,"Lowest Acceptable Quality (LAQ = knock-out)",null,null,null,{"$f":"IF(+'HULP-velden'!C15<0,\"n.v.t.\",+'HULP-velden'!D16)","v":"n.v.t."},"Inschrijfprijs",null,null,{"$f":"IF(ISERROR(VLOOKUP(1,C$19:L$23,7,FALSE)),\"\",VLOOKUP(1,C$19:L$23,7,FALSE))","v":379000}]
[null,null,null,"Kwaliteit voorbeeldinschrijving (Qvbi)",null,null,null,{"$f":"+'HULP-velden'!C12","v":250},"Kwaliteitscore (SPi)",null,null,{"$f":"L11-L10","v":302.5}]
[null,null,null,"Prijs voorbeeld inschrijving (Pvbi)",null,null,null,{"$f":"+'HULP-velden'!C8","v":400000},"Kwaliteitscore (SQi)",null,null,{"$f":"IF(ISERROR(VLOOKUP(1,C$19:L$23,8,FALSE)),\"\",VLOOKUP(1,C$19:L$23,8,FALSE))","v":425}]
[null,null,null,"Gewicht voor kwaliteit (Wq)",null,null,null,{"$f":"Dashboard!H12","v":0.5},"BPK-Score",null,null,{"$f":"IF(ISERROR(VLOOKUP(1,C$19:L$23,9,FALSE)),\"\",VLOOKUP(1,C$19:L$23,9,FALSE))","v":727.5}]
[null,null,null,"Gewicht voor prijs (Wp)",null,null,null,{"$f":"Dashboard!H13","v":0.5}]
[null,null,null,"n-waarde voor kromming scoregraph prijs",null,null,null,{"$f":"Dashboard!H16","v":1}]
[null,null,null,"Bovengrens vergelijkingswaarde (Pmax)",null,null,null,{"$f":"Dashboard!H14","v":500000}]
[null,null,null,"Ondergrens vergelijkingswaarde (Pmin)",null,null,null,{"$f":"Dashboard!H15","v":300000}]
[]
[null,null,null,"Legenda voorbeeld inschrijvingen",null,null,null,null,"Gegevens voor grafiek"]
[null,null,null,"#","Pi","Pi","Qi","Qi","Pi","Qi","Scorei","Rang"]
[null,null,{"$f":"L19","v":5},"1",{"$f":"ROUND('HULP-velden'!$C$8 - 0.15 * ('HULP-velden'!$C$17-'HULP-velden'!$C$8),1)","v":385000},null,{"$f":"ROUND('HULP-velden'!$C$12 + 0.35 * ('HULP-velden'!$C$6-'HULP-velden'!$C$12),0)","v":338},null,{"$f":"IF(F19=\"\",E19,F19)","v":385000},{"$f":"IF(H19=\"\",G19,H19)","v":338},{"$f":"'HULP-velden'!F41","v":625.5},{"$f":"+'HULP-velden'!I41","v":5}]
[null,null,{"$f":"L20","v":2},"2",{"$f":"ROUND('HULP-velden'!$C$8 - 0.4 * ('HULP-velden'!$C$17-'HULP-velden'!$C$8),1)","v":360000},null,{"$f":"ROUND('HULP-velden'!$C$12 + 0.45 * ('HULP-velden'!$C$6-'HULP-velden'!$C$12),0)","v":363},null,{"$f":"IF(F20=\"\",E20,F20)","v":360000},{"$f":"IF(H20=\"\",G20,H20)","v":363},{"$f":"'HULP-velden'!F42","v":713},{"$f":"+'HULP-velden'!I42","v":2}]
[null,null,{"$f":"L21","v":3},"3",{"$f":"ROUND('HULP-velden'!$C$8 + 0.05 * ('HULP-velden'!$C$17-'HULP-velden'!$C$8),1)","v":405000},null,{"$f":"ROUND('HULP-velden'!$C$12 + 0.8 * ('HULP-velden'!$C$6-'HULP-velden'!$C$12),0)","v":450},null,{"$f":"IF(F21=\"\",E21,F21)","v":405000},{"$f":"IF(H21=\"\",G21,H21)","v":450},{"$f":"'HULP-velden'!F43","v":687.5},{"$f":"+'HULP-velden'!I43","v":3}]
[null,null,{"$f":"L22","v":1},"4",{"$f":"ROUND('HULP-velden'!$C$8 - 0.21* ('HULP-velden'!$C$17-'HULP-velden'!$C$8),1)","v":379000},null,{"$f":"ROUND('HULP-velden'!$C$12 + 0.7 * ('HULP-velden'!$C$6-'HULP-velden'!$C$12),0)","v":425},null,{"$f":"IF(F22=\"\",E22,F22)","v":379000},{"$f":"IF(H22=\"\",G22,H22)","v":425},{"$f":"'HULP-velden'!F44","v":727.5},{"$f":"+'HULP-velden'!I44","v":1}]
[null,null,{"$f":"L23","v":4},"5",{"$f":"ROUND('HULP-velden'!$C$8 - 0 * ('HULP-velden'!$C$17-'HULP-velden'!$C$8),1)","v":400000},null,{"$f":"ROUND('HULP-velden'!$C$12 + 0.55 * ('HULP-velden'!$C$6-'HULP-velden'!$C$12),0)","v":388},null,{"$f":"IF(F23=\"\",E23,F23)","v":400000},{"$f":"IF(H23=\"\",G23,H23)","v":388},{"$f":"'HULP-velden'!F45","v":638},{"$f":"+'HULP-velden'!I45","v":4}]
[]
[]
[]
[]
[]
[]
[]
[]
[null,null,null,null,null,null,null,null,null,null,null,null,null,null,null,null,null,null,null,null,null,null," "]

{"sheet":"Scenarioanalyse","index":4,"n_rows":23,"n_cols":23,"rows_kept":23,"cut":false,"hidden":false,"merged":[[21,2,22,2],[5,9,6,9],[5,7,6,7],[5,8,6,8],[1,1,3,3],[5,6,6,6]]}
[]
[null,{"$f":"\"Scenarioanalyse voor Gewogen Factor Methode\"","v":"Scenarioanalyse voor Gewogen Factor Methode"}]
[null,null,null,null,null," "]
[]
[]
[null,null,null,null,null,null,"Alternatief\nPi","Qi","Alternatief\nQi","Qi \nin %"]
[null,null,null,"Scenario","Tonen","Pi",null,null,null,null,"Si","Rang-\norde"]
[null,null,1,{"$f":"\"Combinatie P/Q (\" & C8 & \")\"","v":"Combinatie P/Q (1)"},"ja",{"$f":"IF(ISERROR(+'HULP-velden'!D124),\"\",+'HULP-velden'!D124)","v":500000},null,{"$f":"+'HULP-velden'!I124","v":475},null,{"$f":"IF(ISBLANK(H8),\"\",+'HULP-velden'!L124)","v":95},{"$f":"+'HULP-velden'!K124","v":475},{"$f":"IF(E8=\"nee\",\"\",+'HULP-velden'!N124)","v":12},null,{"$f":"+'HULP-velden'!F124","v":500000}]
[null,null,2,"Combinatie P/Q (2)","ja",{"$f":"IF(ISERROR(+'HULP-velden'!D125),\"\",+'HULP-velden'!D125)","v":481818.18181818182},null,{"$f":"+'HULP-velden'!I125","v":450},null,{"$f":"IF(ISBLANK(H9),\"\",+'HULP-velden'!L125)","v":90},{"$f":"+'HULP-velden'!K125","v":495.5},{"$f":"IF(E9=\"nee\",\"\",+'HULP-velden'!N125)","v":11},null,{"$f":"+'HULP-velden'!F125","v":481818.18181818182}]
[null,null,3,"Combinatie P/Q (3)","ja",{"$f":"IF(ISERROR(+'HULP-velden'!D126),\"\",+'HULP-velden'!D126)","v":463636.36363636365},null,{"$f":"+'HULP-velden'!I126","v":425},null,{"$f":"IF(ISBLANK(H10),\"\",+'HULP-velden'!L126)","v":85},{"$f":"+'HULP-velden'!K126","v":515.9},{"$f":"IF(E10=\"nee\",\"\",+'HULP-velden'!N126)","v":10},null,{"$f":"+'HULP-velden'!F126","v":463636.36363636365}]
[null,null,4,"Combinatie P/Q (4)","ja",{"$f":"IF(ISERROR(+'HULP-velden'!D127),\"\",+'HULP-velden'!D127)","v":445454.54545454547},null,{"$f":"+'HULP-velden'!I127","v":400},null,{"$f":"IF(ISBLANK(H11),\"\",+'HULP-velden'!L127)","v":80},{"$f":"+'HULP-velden'!K127","v":536.4},{"$f":"IF(E11=\"nee\",\"\",+'HULP-velden'!N127)","v":9},null,{"$f":"+'HULP-velden'!F127","v":445454.54545454547}]
[null,null,5,"Combinatie P/Q (5)","ja",{"$f":"IF(ISERROR(+'HULP-velden'!D128),\"\",+'HULP-velden'!D128)","v":427272.72727272729},null,{"$f":"+'HULP-velden'!I128","v":375},null,{"$f":"IF(ISBLANK(H12),\"\",+'HULP-velden'!L128)","v":75},{"$f":"+'HULP-velden'!K128","v":556.79999999999995},{"$f":"IF(E12=\"nee\",\"\",+'HULP-velden'!N128)","v":8},null,{"$f":"+'HULP-velden'!F128","v":427272.72727272729}]
[null,null,6,"Combinatie P/Q (6)","ja",{"$f":"IF(ISERROR(+'HULP-velden'!D129),\"\",+'HULP-velden'!D129)","v":409090.90909090912},null,{"$f":"+'HULP-velden'!I129","v":350},null,{"$f":"IF(ISBLANK(H13),\"\",+'HULP-velden'!L129)","v":70},{"$f":"+'HULP-velden'!K129","v":577.29999999999995},{"$f":"IF(E13=\"nee\",\"\",+'HULP-velden'!N129)","v":7},null,{"$f":"+'HULP-velden'!F129","v":409090.90909090912}]
[null,null,7,"Combinatie P/Q (7)","ja",{"$f":"IF(ISERROR(+'HULP-velden'!D130),\"\",+'HULP-velden'!D130)","v":390909.09090909094},null,{"$f":"+'HULP-velden'!I130","v":325},null,{"$f":"IF(ISBLANK(H14),\"\",+'HULP-velden'!L130)","v":65},{"$f":"+'HULP-velden'!K130","v":597.70000000000005},{"$f":"IF(E14=\"nee\",\"\",+'HULP-velden'!N130)","v":6},null,{"$f":"+'HULP-velden'!F130","v":390909.09090909094}]
[null,null,8,"Combinatie P/Q (8)","ja",{"$f":"IF(ISERROR(+'HULP-velden'!D131),\"\",+'HULP-velden'!D131)","v":372727.27272727276},null,{"$f":"+'HULP-velden'!I131","v":300},null,{"$f":"IF(ISBLANK(H15),\"\",+'HULP-velden'!L131)","v":60},{"$f":"+'HULP-velden'!K131","v":618.20000000000005},{"$f":"IF(E15=\"nee\",\"\",+'HULP-velden'!N131)","v":5},null,{"$f":"+'HULP-velden'!F131","v":372727.27272727276}]
[null,null,9,"Combinatie P/Q (9)","ja",{"$f":"IF(ISERROR(+'HULP-velden'!D132),\"\",+'HULP-velden'!D132)","v":354545.45454545459},null,{"$f":"+'HULP-velden'!I132","v":275},null,{"$f":"IF(ISBLANK(H16),\"\",+'HULP-velden'!L132)","v":55},{"$f":"+'HULP-velden'!K132","v":638.6},{"$f":"IF(E16=\"nee\",\"\",+'HULP-velden'!N132)","v":4},null,{"$f":"+'HULP-velden'!F132","v":354545.45454545459}]
[null,null,10,"Combinatie P/Q (10)","ja",{"$f":"IF(ISERROR(+'HULP-velden'!D133),\"\",+'HULP-velden'!D133)","v":336363.63636363641},null,{"$f":"+'HULP-velden'!I133","v":250},null,{"$f":"IF(ISBLANK(H17),\"\",+'HULP-velden'!L133)","v":50},{"$f":"+'HULP-velden'!K133","v":659.1},{"$f":"IF(E17=\"nee\",\"\",+'HULP-velden'!N133)","v":3},null,{"$f":"+'HULP-velden'!F133","v":336363.63636363641}]
[null,null,11,"Combinatie P/Q (11)","ja",{"$f":"IF(ISERROR(+'HULP-velden'!D134),\"\",+'HULP-velden'!D134)","v":318181.81818181823},null,{"$f":"+'HULP-velden'!I134","v":225},null,{"$f":"IF(ISBLANK(H18),\"\",+'HULP-velden'!L134)","v":45},{"$f":"+'HULP-velden'!K134","v":679.5},{"$f":"IF(E18=\"nee\",\"\",+'HULP-velden'!N134)","v":2},null,{"$f":"+'HULP-velden'!F134","v":318181.81818181823}]
[null,null,12,"Combinatie P/Q (12)","ja",{"$f":"IF(ISERROR(+'HULP-velden'!D135),\"\",+'HULP-velden'!D135)","v":300000.00000000006},null,{"$f":"+'HULP-velden'!I135","v":200},null,{"$f":"IF(ISBLANK(H19),\"\",+'HULP-velden'!L135)","v":40},{"$f":"+'HULP-velden'!K135","v":700},{"$f":"IF(E19=\"nee\",\"\",+'HULP-velden'!N135)","v":1},null,{"$f":"+'HULP-velden'!F135","v":300000.00000000006}]
[null,null,null,"Voorbeeld P/Q-combinatie",null,{"$f":"+'HULP-velden'!$C$8","v":400000},null,{"$f":"+'HULP-velden'!$C$12","v":250},null,{"$f":"IF(ISBLANK(H20),\"\",+'HULP-velden'!$I$63)","v":50},{"$f":"+'HULP-velden'!K136","v":500}]
[]
[null,null,"A",{"$f":"\"Start aanbodlijn in punten.\"","v":"Start aanbodlijn in punten."},null,null,null,200,null,null,null,null,null,null,null,null,null,null,null,null,null,null," "]
[null,null,null,"Totaal aantal punten dat aan de wensen wordt toegekend.",null,null,null,{"$f":"Dashboard!H10","v":500},"= SQwensen"]

{"sheet":"Evaluatie","index":5,"n_rows":22,"n_cols":21,"rows_kept":22,"cut":false,"hidden":false,"merged":[[5,6,6,6],[1,1,3,1]]}
[]
[null,{"$f":"\"Evaluatie voor \" & DATA!C35 & \" \" & DATA!C34","v":"Evaluatie voor    "}]
[]
[]
[]
[null,null,null,null,null,null,"Qi"]
[null,null,null,"#","Inschrijver","Pi",null,"in %","SCOREi","Rang-\norde"]
[null,null,null,"1",null,null,null,{"$f":"DATA!E61","v":""},{"$f":"DATA!F61","v":""},{"$f":"IF(I8=\"\",\"\",DATA!G61)","v":""}]
[null,null,null,"2",null,null,null,{"$f":"DATA!E62","v":""},{"$f":"DATA!F62","v":""},{"$f":"IF(I9=\"\",\"\",DATA!G62)","v":""}]
[null,null,null,"3",null,null,null,{"$f":"DATA!E63","v":""},{"$f":"DATA!F63","v":""},{"$f":"IF(I10=\"\",\"\",DATA!G63)","v":""}]
[null,null,null,"4",null,null,null,{"$f":"DATA!E64","v":""},{"$f":"DATA!F64","v":""},{"$f":"IF(I11=\"\",\"\",DATA!G64)","v":""}]
[null,null,null,"5",null,null,null,{"$f":"DATA!E65","v":""},{"$f":"DATA!F65","v":""},{"$f":"IF(I12=\"\",\"\",DATA!G65)","v":""}]
[null,null,null,"6",null,null,null,{"$f":"DATA!E66","v":""},{"$f":"DATA!F66","v":""},{"$f":"IF(I13=\"\",\"\",DATA!G66)","v":""}]
[null,null,null,"7",null,null,null,{"$f":"DATA!E67","v":""},{"$f":"DATA!F67","v":""},{"$f":"IF(I14=\"\",\"\",DATA!G67)","v":""}]
[null,null,null,"8",null,null,null,{"$f":"DATA!E68","v":""},{"$f":"DATA!F68","v":""},{"$f":"IF(I15=\"\",\"\",DATA!G68)","v":""}]
[null,null,null,"9",null,null,null,{"$f":"DATA!E69","v":""},{"$f":"DATA!F69","v":""},{"$f":"IF(I16=\"\",\"\",DATA!G69)","v":""}]
[null,null,null,"10",null,null,null,{"$f":"DATA!E70","v":""},{"$f":"DATA!F70","v":""},{"$f":"IF(I17=\"\",\"\",DATA!G70)","v":""}]
[null,null,null,"11",null,null,null,{"$f":"DATA!E71","v":""},{"$f":"DATA!F71","v":""},{"$f":"IF(I18=\"\",\"\",DATA!G71)","v":""}]
[null,null,null,"12",null,null,null,{"$f":"DATA!E72","v":""},{"$f":"DATA!F72","v":""},{"$f":"IF(I19=\"\",\"\",DATA!G72)","v":""}]
[null,null,null,null,"Referentie",{"$f":"+'HULP-velden'!$C$8","v":400000},{"$f":"+'HULP-velden'!$C$12","v":250},{"$f":"IF(ISBLANK(G20),\"\",+'HULP-velden'!$I$63)","v":50},{"$f":"IF(ISBLANK(G20),\"\",'HULP-velden'!H63)","v":500}]
[]
[null,null,null,null,null,null,null,null,null,null,null,null,null,null,null,null,null,null,null,null," "]

{"sheet":"TBV Onderzoek","index":6,"n_rows":23,"n_cols":21,"rows_kept":23,"cut":false,"hidden":false,"merged":[[5,16,5,17],[6,16,6,17],[1,1,3,7],[5,3,5,4],[7,8,7,10],[6,8,6,9],[5,8,5,12]]}
[]
[null,{"$f":"\"Data voor onderzoek Gewogen Factor Methode\"","v":"Data voor onderzoek Gewogen Factor Methode"}]
[]
[]
[]
[null,"Naam inkooptraject",null,{"$f":"Dashboard!E6","v":" "},null,null,"Naam organisatie",null,null,null,null,null,null,null,"Contactpersoon"]
[null,"Kenmerk",null,{"$f":"Dashboard!E7","v":" "},null,null,"Datum Publicatie",null,null,null,null,null,null,null,"Telefoonnummer"]
[null,"Methodiek",null,{"$f":"Dashboard!F7","v":"Machtsformule"},null,null,"CPV-code"]
[]
[null,"N.B. Onderstaande gegevens worden gedeeld met het IUC Belastingienst voor onderzoek. De namen van de inschrijvers zijn geannonimiseerd. "]
[null,"#","Kenmerk","Naam inkooptraject","CPV-code","Datum\nPublicatie","Formule","Pref","Qref","Qwensen","Wq","Wp","Ondergrens","Bovengrens","LAQ","n-waarde","Naam\nInschrijver","P(inschrijver)","Qi","Score","Rang"]
[null,1,{"$f":"$D$7","v":" "},{"$f":"$D$6","v":" "},{"$f":"$I$8","v":0},{"$f":"$I$7","v":"00:00:00"},{"$f":"Dashboard!$F$7","v":"Machtsformule"},{"$f":"'HULP-velden'!$C$8","v":400000},{"$f":"'HULP-velden'!$M$15","v":250},{"$f":"'HULP-velden'!$C$6","v":500},{"$f":"'HULP-velden'!$C$10","v":0.5},{"$f":"+'HULP-velden'!$C$11","v":0.5},{"$f":"+'HULP-velden'!$C$14","v":300000},{"$f":"+'HULP-velden'!$C$17","v":500000},{"$f":"+'HULP-velden'!$C$15","v":-1000},{"$f":"+'HULP-velden'!$C$16","v":1},"Inschrijver 1",{"$f":"+Evaluatie!F8","v":0},{"$f":"+Evaluatie!G8","v":0},{"$f":"+Evaluatie!I8","v":""},{"$f":"+Evaluatie!J8","v":""}]
[null,2," "," ",0,"00:00:00",{"$f":"Dashboard!$F$7","v":"Machtsformule"},{"$f":"'HULP-velden'!$C$8","v":400000},{"$f":"'HULP-velden'!$M$15","v":250},{"$f":"'HULP-velden'!$C$6","v":500},{"$f":"'HULP-velden'!$C$10","v":0.5},{"$f":"+'HULP-velden'!$C$11","v":0.5},{"$f":"+'HULP-velden'!$C$14","v":300000},{"$f":"+'HULP-velden'!$C$17","v":500000},{"$f":"+'HULP-velden'!$C$15","v":-1000},{"$f":"+'HULP-velden'!$C$16","v":1},"Inschrijver 2",{"$f":"+Evaluatie!F9","v":0},{"$f":"+Evaluatie!G9","v":0},{"$f":"+Evaluatie!I9","v":""},{"$f":"+Evaluatie!J9","v":""}]
[null,3," "," ",0,"00:00:00",{"$f":"Dashboard!$F$7","v":"Machtsformule"},{"$f":"'HULP-velden'!$C$8","v":400000},{"$f":"'HULP-velden'!$M$15","v":250},{"$f":"'HULP-velden'!$C$6","v":500},{"$f":"'HULP-velden'!$C$10","v":0.5},{"$f":"+'HULP-velden'!$C$11","v":0.5},{"$f":"+'HULP-velden'!$C$14","v":300000},{"$f":"+'HULP-velden'!$C$17","v":500000},{"$f":"+'HULP-velden'!$C$15","v":-1000},{"$f":"+'HULP-velden'!$C$16","v":1},"Inschrijver 3",{"$f":"+Evaluatie!F10","v":0},{"$f":"+Evaluatie!G10","v":0},{"$f":"+Evaluatie!I10","v":""},{"$f":"+Evaluatie!J10","v":""}]
[null,4," "," ",0,"00:00:00",{"$f":"Dashboard!$F$7","v":"Machtsformule"},{"$f":"'HULP-velden'!$C$8","v":400000},{"$f":"'HULP-velden'!$M$15","v":250},{"$f":"'HULP-velden'!$C$6","v":500},{"$f":"'HULP-velden'!$C$10","v":0.5},{"$f":"+'HULP-velden'!$C$11","v":0.5},{"$f":"+'HULP-velden'!$C$14","v":300000},{"$f":"+'HULP-velden'!$C$17","v":500000},{"$f":"+'HULP-velden'!$C$15","v":-1000},{"$f":"+'HULP-velden'!$C$16","v":1},"Inschrijver 4",{"$f":"+Evaluatie!F11","v":0},{"$f":"+Evaluatie!G11","v":0},{"$f":"+Evaluatie!I11","v":""},{"$f":"+Evaluatie!J11","v":""}]
[null,5," "," ",0,"00:00:00",{"$f":"Dashboard!$F$7","v":"Machtsformule"},{"$f":"'HULP-velden'!$C$8","v":400000},{"$f":"'HULP-velden'!$M$15","v":250},{"$f":"'HULP-velden'!$C$6","v":500},{"$f":"'HULP-velden'!$C$10","v":0.5},{"$f":"+'HULP-velden'!$C$11","v":0.5},{"$f":"+'HULP-velden'!$C$14","v":300000},{"$f":"+'HULP-velden'!$C$17","v":500000},{"$f":"+'HULP-velden'!$C$15","v":-1000},{"$f":"+'HULP-velden'!$C$16","v":1},"Inschrijver 5",{"$f":"+Evaluatie!F12","v":0},{"$f":"+Evaluatie!G12","v":0},{"$f":"+Evaluatie!I12","v":""},{"$f":"+Evaluatie!J12","v":""}]
[null,6," "," ",0,"00:00:00",{"$f":"Dashboard!$F$7","v":"Machtsformule"},{"$f":"'HULP-velden'!$C$8","v":400000},{"$f":"'HULP-velden'!$M$15","v":250},{"$f":"'HULP-velden'!$C$6","v":500},{"$f":"'HULP-velden'!$C$10","v":0.5},{"$f":"+'HULP-velden'!$C$11","v":0.5},{"$f":"+'HULP-velden'!$C$14","v":300000},{"$f":"+'HULP-velden'!$C$17","v":500000},{"$f":"+'HULP-velden'!$C$15","v":-1000},{"$f":"+'HULP-velden'!$C$16","v":1},"Inschrijver 6",{"$f":"+Evaluatie!F13","v":0},{"$f":"+Evaluatie!G13","v":0},{"$f":"+Evaluatie!I13","v":""},{"$f":"+Evaluatie!J13","v":""}]
[null,7," "," ",0,"00:00:00",{"$f":"Dashboard!$F$7","v":"Machtsformule"},{"$f":"'HULP-velden'!$C$8","v":400000},{"$f":"'HULP-velden'!$M$15","v":250},{"$f":"'HULP-velden'!$C$6","v":500},{"$f":"'HULP-velden'!$C$10","v":0.5},{"$f":"+'HULP-velden'!$C$11","v":0.5},{"$f":"+'HULP-velden'!$C$14","v":300000},{"$f":"+'HULP-velden'!$C$17","v":500000},{"$f":"+'HULP-velden'!$C$15","v":-1000},{"$f":"+'HULP-velden'!$C$16","v":1},"Inschrijver 7",{"$f":"+Evaluatie!F14","v":0},{"$f":"+Evaluatie!G14","v":0},{"$f":"+Evaluatie!I14","v":""},{"$f":"+Evaluatie!J14","v":""}]
[null,8," "," ",0,"00:00:00",{"$f":"Dashboard!$F$7","v":"Machtsformule"},{"$f":"'HULP-velden'!$C$8","v":400000},{"$f":"'HULP-velden'!$M$15","v":250},{"$f":"'HULP-velden'!$C$6","v":500},{"$f":"'HULP-velden'!$C$10","v":0.5},{"$f":"+'HULP-velden'!$C$11","v":0.5},{"$f":"+'HULP-velden'!$C$14","v":300000},{"$f":"+'HULP-velden'!$C$17","v":500000},{"$f":"+'HULP-velden'!$C$15","v":-1000},{"$f":"+'HULP-velden'!$C$16","v":1},"Inschrijver 8",{"$f":"+Evaluatie!F15","v":0},{"$f":"+Evaluatie!G15","v":0},{"$f":"+Evaluatie!I15","v":""},{"$f":"+Evaluatie!J15","v":""}]
[null,9," "," ",0,"00:00:00",{"$f":"Dashboard!$F$7","v":"Machtsformule"},{"$f":"'HULP-velden'!$C$8","v":400000},{"$f":"'HULP-velden'!$M$15","v":250},{"$f":"'HULP-velden'!$C$6","v":500},{"$f":"'HULP-velden'!$C$10","v":0.5},{"$f":"+'HULP-velden'!$C$11","v":0.5},{"$f":"+'HULP-velden'!$C$14","v":300000},{"$f":"+'HULP-velden'!$C$17","v":500000},{"$f":"+'HULP-velden'!$C$15","v":-1000},{"$f":"+'HULP-velden'!$C$16","v":1},"Inschrijver 9",{"$f":"+Evaluatie!F16","v":0},{"$f":"+Evaluatie!G16","v":0},{"$f":"+Evaluatie!I16","v":""},{"$f":"+Evaluatie!J16","v":""}]
[null,10," "," ",0,"00:00:00",{"$f":"Dashboard!$F$7","v":"Machtsformule"},{"$f":"'HULP-velden'!$C$8","v":400000},{"$f":"'HULP-velden'!$M$15","v":250},{"$f":"'HULP-velden'!$C$6","v":500},{"$f":"'HULP-velden'!$C$10","v":0.5},{"$f":"+'HULP-velden'!$C$11","v":0.5},{"$f":"+'HULP-velden'!$C$14","v":300000},{"$f":"+'HULP-velden'!$C$17","v":500000},{"$f":"+'HULP-velden'!$C$15","v":-1000},{"$f":"+'HULP-velden'!$C$16","v":1},"Inschrijver 10",{"$f":"+Evaluatie!F17","v":0},{"$f":"+Evaluatie!G17","v":0},{"$f":"+Evaluatie!I17","v":""},{"$f":"+Evaluatie!J17","v":""}]
[null,11," "," ",0,"00:00:00",{"$f":"Dashboard!$F$7","v":"Machtsformule"},{"$f":"'HULP-velden'!$C$8","v":400000},{"$f":"'HULP-velden'!$M$15","v":250},{"$f":"'HULP-velden'!$C$6","v":500},{"$f":"'HULP-velden'!$C$10","v":0.5},{"$f":"+'HULP-velden'!$C$11","v":0.5},{"$f":"+'HULP-velden'!$C$14","v":300000},{"$f":"+'HULP-velden'!$C$17","v":500000},{"$f":"+'HULP-velden'!$C$15","v":-1000},{"$f":"+'HULP-velden'!$C$16","v":1},"Inschrijver 11",{"$f":"+Evaluatie!F18","v":0},{"$f":"+Evaluatie!G18","v":0},{"$f":"+Evaluatie!I18","v":""},{"$f":"+Evaluatie!J18","v":""}]
[null,12," "," ",0,"00:00:00",{"$f":"Dashboard!$F$7","v":"Machtsformule"},{"$f":"'HULP-velden'!$C$8","v":400000},{"$f":"'HULP-velden'!$M$15","v":250},{"$f":"'HULP-velden'!$C$6","v":500},{"$f":"'HULP-velden'!$C$10","v":0.5},{"$f":"+'HULP-velden'!$C$11","v":0.5},{"$f":"+'HULP-velden'!$C$14","v":300000},{"$f":"+'HULP-velden'!$C$17","v":500000},{"$f":"+'HULP-velden'!$C$15","v":-1000},{"$f":"+'HULP-velden'!$C$16","v":1},"Inschrijver 12",{"$f":"+Evaluatie!F19","v":0},{"$f":"+Evaluatie!G19","v":0},{"$f":"+Evaluatie!I19","v":""},{"$f":"+Evaluatie!J19","v":""}]

{"sheet":"HULP-velden","index":7,"n_rows":301,"n_cols":82,"rows_kept":301,"cut":false,"hidden":true,"merged":[[16,21,18,22],[43,11,44,12],[84,4,85,4]]}
[null,null,null,null,null,null,null,null,null,null,null,null,null,null,null,null,null,null,null,null,null,null,null,null,null,null,null,null,null,null,null,null,null,null,null,null,null,null,null,null,null,null,null,null,null,null,null,null,null,null,null,null,null,"Voorbeeld",null,null,null,null,null,null,null,null,null,null,null,null,null,"Aanbodcourve",null,null,"1","2","3","4","5","6","7","8","9","10","11","12"]
[null,"Hulpvelden",null,null,null,null,null,null,null,null,null,null,null,null,null,null,null,null,null,null,null,null,null,null,null,null,null,null,null,null,null,null,null,null,null,null,null,null,null,null,null,null,null,null,null,"Voorbeeldinschrijving",null,null,{"$f":"+C8","v":400000},{"$f":"TEXT(AW2,\"€#.##0,00\")","v":"€400.000,00"},null,null,"Voorbeeld",null,{"$f":"Dashboard!H20","v":500},{"$f":"TEXT(BC2,\"#.##0,0\")","v":"500,0"},null,"Winnaar",null,{"$f":"'Info BD'!L7","v":"4"},{"$f":"TEXT(BH2,\"#.##0\")","v":"4"},null,"LAQ",{"$f":"Dashboard!H22","v":0},{"$f":"TEXT(BL2,\"#.##0\")","v":"0"},null,"1",{"$f":"IF(Scenarioanalyse!E8=\"nee\",\"\",F124)","v":500000},{"$f":"IF(Scenarioanalyse!E8=\"nee\",\"\",L124)","v":95},null,{"$f":"F124","v":500000},{"$f":"F125","v":481818.18181818182},{"$f":"F126","v":463636.36363636365},{"$f":"F127","v":445454.54545454547},{"$f":"F128","v":427272.72727272729},{"$f":"F129","v":409090.90909090912},{"$f":"F130","v":390909.09090909094},{"$f":"F131","v":372727.27272727276},{"$f":"F132","v":354545.45454545459},{"$f":"F133","v":336363.63636363641},{"$f":"F134","v":318181.81818181823},{"$f":"F135","v":300000.00000000006}]
[null,null,null,null,null,null,null,null,null,null,null,null,null,null,null,null,null,null,null,null,null,null,null,null,null,null,null,null,null,null,null,null,null,null,null,null,null,null,null,null,null,null,null,null,null,"Qwensen",null,null,{"$f":"+C6","v":500},{"$f":"TEXT(AW3,\"#.##0\")","v":"500"},null,null,"Lijn+1",null,{"$f":"AN19","v":550},{"$f":"TEXT(BC3,\"#.##0,0\")","v":"550,0"},null,"Inschrijfprijs",null,{"$f":"+'Info BD'!L8","v":379000},{"$f":"TEXT(BH3,\"€#.##0,00\")","v":"€379.000,00"},null,null,null,null,null,"2",{"$f":"IF(Scenarioanalyse!E9=\"nee\",\"\",F125)","v":481818.18181818182},{"$f":"IF(Scenarioanalyse!E9=\"nee\",\"\",L125)","v":90},null,{"$f":"L124","v":95},{"$f":"L125","v":90},{"$f":"L126","v":85},{"$f":"L127","v":80},{"$f":"L128","v":75},{"$f":"L129","v":70},{"$f":"L130","v":65},{"$f":"L131","v":60},{"$f":"L132","v":55},{"$f":"L133","v":50},{"$f":"L134","v":45},{"$f":"L135","v":40}]
[null,null,null,null,null,null,null,null,null,null,null,null,null,null,null,null,null,null,null,null,null,null,null,null,null,null,null,null," ",null,null,null,null,null,null,null,null,null,null,null,null,null,null,null,null,"SQvbi",null,null,{"$f":"+C12","v":250},{"$f":"TEXT(AW4,\"#.##0,0\")","v":"250,0"},null,null,"Lijn+2",null,{"$f":"+AO19","v":600},{"$f":"TEXT(BC4,\"#.##0,0\")","v":"600,0"},null,"Kwaliteitsscore",null,{"$f":"+'Info BD'!L10","v":425},{"$f":"TEXT(BH4,\"#.##0,0\")","v":"425,0"},null,null,null,null,null,"3",{"$f":"IF(Scenarioanalyse!E10=\"nee\",\"\",F126)","v":463636.36363636365},{"$f":"IF(Scenarioanalyse!E10=\"nee\",\"\",L126)","v":85}]
[null,"Delta",{"$f":"IF(Dashboard!G9=\"Nee\",0,Dashboard!G14)","v":0},{"$f":"(1+C5)*Dashboard!H15","v":300000},"Formule",null,"QSmax",{"$f":"C6","v":500},null,null,null,null,null,null,null,null,null,null,null,null,null,null,null,null,null,null,null,null,null,null,null,null,null,null,null,null,null,null,null,null,null,null,null,null,null,"SPvbi",null,null,{"$f":"C164","v":250},{"$f":"TEXT(AW5,\"#.##0,0\")","v":"250,0"},{"$f":"+AX4+AX5","v":500},{"$f":"TEXT(AY5,\"#.##0,0\")","v":"500,0"},"Lijn+3",null,{"$f":"+AP19","v":650},{"$f":"TEXT(BC5,\"#.##0,0\")","v":"650,0"},null,"Kwaliteitsscore Adapt",null,null,null,null,"Score voorbeeld",{"$f":"+BC2/10^AW8","v":50},{"$f":"TEXT(BL5,\"#.##0,000#########################\")","v":"50,000"},null,"4",{"$f":"IF(Scenarioanalyse!E11=\"nee\",\"\",F127)","v":445454.54545454547},{"$f":"IF(Scenarioanalyse!E11=\"nee\",\"\",L127)","v":80}]
[null,"Qwensen",{"$f":"Dashboard!H10","v":500},"Qwensen",{"$f":"Dashboard!F7","v":"Machtsformule"},null,"PSmax",{"$f":"C6/C10*C11","v":500},{"$f":"IF(H6<>ROUND(H6,0),1,0)","v":0},null,null,null,null,null,null,null,null,null,null,null,null,null,null,null,null,null,null,null,null,null,null,null,null,null,null,null,null,null,null,null,null,null,null,null,null,"Wq",null,null,{"$f":"+C10","v":0.5},{"$f":"TEXT(AW6,\"#.##0%\")","v":"50%"},null,null,"Qmin",null,100,{"$f":"TEXT(BC6,\"#.##0\")","v":"100"},null,"BPK-Score",null,{"$f":"'Info BD'!L11","v":727.5},{"$f":"TEXT(BH6,\"#.##0,0\")","v":"727,5"},null,"Pmax",{"$f":"C17","v":500000},{"$f":"TEXT(BL6,\"€#.##0,00\")","v":"€500.000,00"},null,"5",{"$f":"IF(Scenarioanalyse!E12=\"nee\",\"\",F128)","v":427272.72727272729},{"$f":"IF(Scenarioanalyse!E12=\"nee\",\"\",L128)","v":75}]
[null,"Stappen",{"$f":"+C6/20","v":25},null,null,null,"Macht",{"$f":"Dashboard!H16","v":1},null,null,null,null,null,null,null,null,null,null,null,null,null,null,null,null,null,null,null,null,null,null,null,null,null,null,null,null,null,null,null,null,null,null,null,null,null,"Wp",null,null,{"$f":"+C11","v":0.5},{"$f":"TEXT(AW7,\"#.##0%\")","v":"50%"},null,null,"Qmax",null,{"$f":"BC6+(1+Dashboard!G14)*BC6","v":200},{"$f":"TEXT(BC7,\"#.##0\")","v":"200"},null,"nummer 2",null,{"$f":"VLOOKUP(2,A$41:$F$46,6,FALSE)","v":713},{"$f":"TEXT(BH7,\"#.##0,0\")","v":"713,0"},null,"Pmin",{"$f":"C14","v":300000},{"$f":"TEXT(BL7,\"€#.##0,00\")","v":"€300.000,00"},null,"6",{"$f":"IF(Scenarioanalyse!E13=\"nee\",\"\",F129)","v":409090.90909090912},{"$f":"IF(Scenarioanalyse!E13=\"nee\",\"\",L129)","v":70}]
[null,"Ref",{"$f":"IF(+Dashboard!H18=0,C14,+Dashboard!H18)","v":400000},"Pref","Minimum percentage",0,"QSvb",{"$f":"+C12","v":250},null,null,null,null,null,null,null,null,null,null,null,null,null,null,null,null,null,null,null,null,null,null,null,null,null,null,null,null,null,null,null,null,null,null,null,null,null,"N-waarde",null,null,{"$f":"C16","v":1},{"$f":"TEXT(AW8,\"#.##0,0\")","v":"1,0"},null,null,"Qadapt",null,{"$f":"+BC7-BC6","v":100},{"$f":"TEXT(BC8,\"#.##0\")","v":"100"},null,"nummer 5",null,{"$f":"VLOOKUP(5,A$41:$F$46,6,FALSE)","v":625.5},{"$f":"TEXT(BH8,\"#.##0,0\")","v":"625,5"},null,"PSmax",{"$f":"H6","v":500},{"$f":"TEXT($BL$8,\"#.##0\")","v":"500"},null,"7",{"$f":"IF(Scenarioanalyse!E14=\"nee\",\"\",F130)","v":390909.09090909094},{"$f":"IF(Scenarioanalyse!E14=\"nee\",\"\",L130)","v":65}]
[null,"Aanbodlijn",true,null,"Maximum percentage",0.4,"PSvb",{"$f":"C164","v":250},null,null,null,null,null,null,null,null,null,null,null,null,null,null,null,null,null,null,null,null,null,null,null,null,null,null,null,null,null,null,null,null,null,null,null,null,null,null,null,null,null,null,null,null,null,null,null,null,null,null,null,null,null,null,"Qsmax",{"$f":"H5","v":500},{"$f":"TEXT(BL9,\"#.##0\")","v":"500"},null,"8",{"$f":"IF(Scenarioanalyse!E15=\"nee\",\"\",F131)","v":372727.27272727276},{"$f":"IF(Scenarioanalyse!E15=\"nee\",\"\",L131)","v":60}]
[null,"Wq",{"$f":"Dashboard!H12","v":0.5},null,null,null,null,{"$f":"SUM(H8:H9)","v":500},null,null,null,"Hulpvelden voor opbouw van de EMVI-lijnen",null,null,null,null,null,null,null,null,null,null,null,null,null,null,null,null,null,null,null,null,null,null,null,null,null,null,null,null,null,null,null,null,null,null,"Tekst voor beschrijvend document",null,null,null,null,null,null,null,null,null,null,null,null,null,null,null,"Stotaal",{"$f":"SUM(BL8:BL9)","v":1000},{"$f":"TEXT(BL10,\"#.##0\")","v":"1.000"},null,"9",{"$f":"IF(Scenarioanalyse!E16=\"nee\",\"\",F132)","v":354545.45454545459},{"$f":"IF(Scenarioanalyse!E16=\"nee\",\"\",L132)","v":55}]
[null,"Wp",{"$f":"1-C10","v":0.5},null,"Delta",{"$f":"IF(Dashboard!G14<>0,Dashboard!G14*100,\"n.v.t.\")","v":"n.v.t."},null,null,null,null,null,null,null,null,null,null,null,null,null,null,null,null,null,null,null,null,null,null,null,null,null,null,null,null,null,null,null,null,null,null,null,null,null,null,null,null,null,null,null,null,null,null,null,null,null,null,null,null,null,null,null,null,null,null,{"$f":"TEXT($BL$8,\"#.##0,00\")","v":"500,00"},null,"10",{"$f":"IF(Scenarioanalyse!E17=\"nee\",\"\",F133)","v":336363.63636363641},{"$f":"IF(Scenarioanalyse!E17=\"nee\",\"\",L133)","v":50}]
[null,"Qref",{"$f":"C6*Dashboard!G19","v":250}," ","Qref =",{"$f":"IF(F11<>\"n.v.t.\",F14+(C12/C6*F11),C12/C6*C20)","v":50},null,null,null,null,null,null,null,null,null,null,null,null,null,null,null,null,null,null,null,null,null,null,null,null,null,null,null,null,null,null,null,null,null,null,null,null,null,null,null,null,null,null,null,null,null,null,null,null,null,null,null,null,null,null,null,null,null,null,null,null,"11",{"$f":"IF(Scenarioanalyse!E18=\"nee\",\"\",F134)","v":318181.81818181823},{"$f":"IF(Scenarioanalyse!E18=\"nee\",\"\",L134)","v":45}]
[null,"Plafondprijs",-100000,{"$f":"TEXT(C13/1000, \"€ #.###\")","v":"-€ 100"},"Qmax",{"$f":"IF(F11<>\"n.v.t.\",F14+F11,C20)","v":100},null,null,null,null,null,"Stappen",{"$f":"+C8/10*1.5","v":60000},null,null,null,null,null,null,null,null,null,null,null,null,null,null,null,null,null,null,null,null,null,null,{"$f":"ROUND(IF($E$6=\"Wortelformule\",$H$6*((($C$17-AJ15)/($C$17-$C$14))^(1/$H$7)),$H$6-$H$6*((AJ15-$C$14)/($C$17-$C$14))^$H$7),2)","v":175},200,225,250,275,300,325,null,null,null,null,null,null,null,null,null,null,null,null,null,null,null,null,null,null,null,null,null,null,null,null,"12",{"$f":"IF(Scenarioanalyse!E19=\"nee\",\"\",F135)","v":300000.00000000006},{"$f":"IF(Scenarioanalyse!E19=\"nee\",\"\",L135)","v":40}]
[null,"Ondergrens",{"$f":"Dashboard!H15","v":300000},null,"Qmin",{"$f":"IF(F11<>\"n.v.t.\",100,0)","v":0},null,null,null,null,null,"Pvbo",{"$f":"+C8","v":400000},null,null," ",null,null,null,null,null,null,null,null,null,null,null,null,null,null,null,null,null,null,null,{"$f":"AK14-$C$7","v":175},{"$f":"AL14-$C$7","v":200},{"$f":"AM14-$C$7","v":225},{"$f":"H8","v":250},{"$f":"AM14+$C$7","v":275},{"$f":"AN14+$C$7","v":300},{"$f":"AO14+$C$7","v":325}]
[null,"LAQ",{"$f":"IF(Dashboard!H22=0,-1000,+F15)","v":-1000},{"$f":"+C15","v":-1000},"LAQ",{"$f":"IF(F11<>\"n.v.t.\",+F14+(Dashboard!$H$22/C6)*F11,+(Dashboard!$H$22/C6)*F13)","v":0},{"$f":"E15& \" = \" & Dashboard!$H$22","v":"LAQ = "},null,null,null,null,"Qvbo",{"$f":"IF(F11<>\"n.v.t.\",+F12,C12)","v":250},null,null,null,null,null,null,null,null,null,null,null,null,null,"Basis voor ",null,null,null,null,null,null,null,null,{"$f":"AK15+$D$18","v":430000},{"$f":"AL15+$D$18","v":420000},{"$f":"AM15+$D$18","v":410000},{"$f":"+C8","v":400000},{"$f":"AM15-$D$18","v":390000},{"$f":"AN15-$D$18","v":380000},{"$f":"AO15-$D$18","v":370000},null,null,null,"Beste prijs-kwaliteitverhouding"]
[null,"n-factor",{"$f":"+Dashboard!H16","v":1},{"$f":"Dashboard!H22","v":0},null,null,{"$f":"B13 & \"; \" & D13","v":"Plafondprijs; -€ 100"},null,null,null,null,"Score",{"$f":"C163","v":500},null,{"$f":"+M17","v":"n.v.t."},null,null,null,null,null,null,null,null,null,null,null,"Grafiek",null,null,null,null,null,null,null,null,"BPK-Lijn -3","BPK-Lijn -2","BPK-Lijn -1","BPK-lijn Ref","BPK-Lijn +1","BPK-Lijn +2","BPK-Lijn +3"]
[null,"Bovengrens",{"$f":"Dashboard!H14","v":500000},{"$f":"+C17","v":500000},"Check_Scenario_Dashboard","True",null,null,null,null,null,null,{"$f":"IF(ISERROR(+M15/M16^($C$10/$C$11)*10^#REF!),\"n.v.t.\",+M15/M16^($C$10/$C$11)*10^#REF!)","v":"n.v.t."},null,null,null,null,null,null,null,null,"Verdelen van de Qwensen in 20 stappen",null,null,null,null,null,null,null,null,null,null,null,null,null,null,null,null,null,null,null,null,null,null,null,"De aanbestedende dienst hecht veel waarde aan een evenwichtige balans tussen prijs en kwaliteit. Om dit te waarborgen, wordt in deze aanbesteding een objectieve beoordelingsmethode gehanteerd die elke inschrijving onafhankelijk van de andere beoordeelt."]
[null,null,{"$f":"+C17-C14","v":200000},{"$f":"+C18/20","v":10000}," ",null,null,null,null,null,null,"Basis","Prijs ",null,"Basis"," ",null,null,null,null,null,null,null,null,null,null,"verschoven","Waarde ",null,null,null,"Wortel","Kwadratische",null,null,"Score-lijn","Score-lijn","Score-lijn","Score-lijn","Score-lijn","Score-lijn","Score-lijn"]
[null,"Hulpvelden",null,null,null,null,null,null,null,null,null,"voor ","voor ",null,"voor "," ",null,null,null,null,null,null,null,null,null,null,"X-as","voor ",null,null,"Keuze","formule","formule",null,null,{"$f":"+AJ14+AJ13","v":350},400,450,500,550,600,650]
[null,"Qmax",{"$f":"+C69","v":100},{"$f":"+C69","v":100},null,null,null,null,null,null,null,"Matrix 2x2","Y-as",null,"Matrix 2x2",null,null,null,null,null,null," ","%","!!",null,null,"Qmin+Qwensen","X-as",null,"P-score","Y-as",null,null,null,null,"X-as","X-as","X-as","X-as","X-as","X-as","X-as"]
[null,"Prijs",0,{"$f":"D105","v":520000},null,"Plafondprijs",{"$f":"C24","v":-100000},{"$f":"D24","v":-100000},null,null,null,"Pi",null,null,"Qi",null,null,null,null,null,null,"Qwensen","deel","X-as",null,null,null,"genormaliseerd",null," ",null," "," ",null,null,"Q-score","Q-score","Q-score","Q-score","Q-score","Q-score","Q-score",null,null,null,{"$f":"\"Een voorbeeldinschrijving (oranje stip) illustreert de werking van de beoordelingsmethode met een prijs van \"&AX2&\" en een prijsscore van \"& AX5 & \" punten en een kwaliteitsscore van \"&AX4&\" punten. Dit resulteert in een totaal van \" &AZ5& \" punten. \"","v":"Een voorbeeldinschrijving (oranje stip) illustreert de werking van de beoordelingsmethode met een prijs van €400.000,00 en een prijsscore van 250,0 punten en een kwaliteitsscore van 250,0 punten. Dit resulteert in een totaal van 500,0 punten. "}]
[null,"Pref",{"$f":"+C8","v":400000},{"$f":"+C8","v":400000},null,"Qref",0,{"$f":"+C12","v":250},null,null,null,0,{"$f":"+$M$14*L22","v":0},0,0,null,null,null,null,null,null,{"$f":"$V$223*W22","v":0},0,{"$f":"F14","v":0},null,null,{"$f":"+X22","v":0},null,null,{"$f":"0","v":0},{"$f":"IF($E$6=\"Wortelformule\",AF22,AG22)","v":500000},{"$f":"$C$17-(AD22^$H$7)*($C$17-$C$14)/($H$6^$H$7)","v":500000},{"$f":"$C$14+($C$17-$C$14)*(($H$6-AD22)/$H$6)^(1/$H$7)","v":500000},null,null,{"$f":"(($AJ$19-AD22)/$H$5)*100","v":70},{"$f":"(($AK$19-AD22)/$H$5)*100","v":80},{"$f":"(($AL$19-AD22)/$H$5)*100","v":90},{"$f":"(($AM$19-AD22)/$H$5)*100","v":100},{"$f":"(($AN$19-AD22)/$H$5)*100","v":110.00000000000001},{"$f":"(($AO$19-AD22)/$H$5)*100","v":120},{"$f":"(($AP$19-AD22)/$H$5)*100","v":130},null,null,null,{"$f":"\"Voor Prijs en Kwaliteit kunnen respectievelijk maximaal \"&BM8&\" en \"&BM9& \" punten worden behaald, wat overeenkomt met een verhouding van \" & AX7& \" voor Prijs en \" & AX6 & \" voor Kwaliteit. \"","v":"Voor Prijs en Kwaliteit kunnen respectievelijk maximaal 500 en 500 punten worden behaald, wat overeenkomt met een verhouding van 50% voor Prijs en 50% voor Kwaliteit. "}]
[null,"Plafondprijs x-as",0,100,null,"Ref lijn",0,0,null,null,null,{"$f":"+L22+0.1","v":0.1},{"$f":"+$M$14*L23","v":40000},{"$f":"+N22+5","v":5},0.1,null,null,null,null,null,null,0.5,{"$f":"+W22+0.005","v":5.0000000000000001E-3},{"$f":"+W23*($X$223-$F$14)+$X$22","v":2.5},null,null,{"$f":"+X23","v":2.5},null,null,{"$f":"+AD22+($H$6/200)","v":2.5},{"$f":"IF($E$6=\"Wortelformule\",AF23,AG23)","v":499000},{"$f":"$C$17-(AD23^$H$7)*($C$17-$C$14)/($H$6^$H$7)","v":499000},{"$f":"$C$14+($C$17-$C$14)*(($H$6-AD23)/$H$6)^(1/$H$7)","v":499000},null,null,{"$f":"(($AJ$19-AD23)/$H$5)*100","v":69.5},{"$f":"(($AK$19-AD23)/$H$5)*100","v":79.5},{"$f":"(($AL$19-AD23)/$H$5)*100","v":89.5},{"$f":"(($AM$19-AD23)/$H$5)*100","v":99.5},{"$f":"(($AN$19-AD23)/$H$5)*100","v":109.5},{"$f":"(($AO$19-AD23)/$H$5)*100","v":119.5},{"$f":"(($AP$19-AD23)/$H$5)*100","v":129.5},null,null,null," "]
[null,"Plafondprijs y-as",-100000,-100000,null,"Ref lijn",{"$f":"+C8","v":400000},{"$f":"+C12","v":250},null,null,null,{"$f":"+L23+0.1","v":0.2},80000,{"$f":"+N23+5","v":10},0.2,null,null,null,null,null,null,1,{"$f":"+W23+0.005","v":0.01},5,null,null,{"$f":"+X24","v":5},null,null,{"$f":"+AD23+($H$6/200)","v":5},498000,498000,498000,null,null,69,79,89,99,109.00000000000001,119,129,null,null,null,{"$f":"\"Verdeeld over de Wensen kunnen in totaal \"& BM9 & \" punten voor Kwaliteit worden gescoord (Qwensen). Etc. …..\"","v":"Verdeeld over de Wensen kunnen in totaal 500 punten voor Kwaliteit worden gescoord (Qwensen). Etc. ….."}]
[null,"Ondergrens",{"$f":"+C14","v":300000},{"$f":"+C14","v":300000},null,"Plafondprijs",{"$f":"C24","v":-100000},null,null,null,null,0.30000000000000004,120000.00000000001,15,0.30000000000000004,null,null,null,null,null,null,1.5,1.4999999999999999E-2,7.5,null,null,7.5,null,null,7.5,497000,497000,497000,null,null,68.5,78.5,88.5,98.5,108.5,118.5,128.5,null,null,null," "]
[null,"LAQ (x-as)",{"$f":"C15","v":-1000},{"$f":"C15","v":-1000},null,"Referentie",{"$f":"+C8","v":400000},null,null,null,null,0.4,160000,20,0.4,null,null,null,null,null,null,2,0.02,10,null,null,10,null,null,10,496000,496000,496000,null,null,68,78,88,98,108,118,128]
[null,"LAQ (y-as)",0,{"$f":"D17","v":500000},null,"Referentie (Qmax)",{"$f":"+I23","v":0},{"$f":"+C17*1.1","v":550000},null,null,null,0.5,200000,25,0.5,null,null,null,null,null,null,2.5,2.5000000000000001E-2,12.5,null,null,12.5,null,null,12.5,495000,495000,495000,null,null,67.5,77.5,87.5,97.5,107.5,117.5,127.49999999999999]
[null,"Qmin",{"$f":"IF(F7=\"\",0,100)","v":0},{"$f":"+C28","v":0},null,"Referentie (onder)",null,null,null,null,null,0.6,240000,30,0.6,null,null,null,null,null,null,3.0000000000000004,3.0000000000000002E-2,15.000000000000002,null,null,15.000000000000002,null,null,15,494000,494000,494000,null,null,67,77,87,97,107,117,127,null,null,null,"BPK-formule"]
[null,"Punten Qmin",0,null,null,null,null,null,null,null,null,0.7,280000,35,0.7,null,null,null,null,null,null,3.5000000000000004,3.5000000000000003E-2,17.5,null,null,17.5,null,null,17.5,493000,493000,493000,null,null,66.5,76.5,86.5,96.5,106.5,116.5,126.49999999999999,null,null,null,"De BPK-score wordt als volgt berekend:"]
[null,"Punten bij Qmax",{"$f":"+Dashboard!H10","v":500},null,null,"Waardelijn (y-as)",{"$f":"IF(Dashboard!$G$9=\"Ja\",+C25,-10000)","v":-10000},{"$f":"IF(Dashboard!$G$9=\"Ja\",+C17,-10000)","v":-10000},null,null,null,0.79999999999999993,320000,40,0.79999999999999993,null,null,null,null,null,null,4,0.04,20,null,null,20,null,null,20,492000,492000,492000,null,null,66,76,86,96,106,115.99999999999999,126]
[null," ",null,null,null,"Waardelijn (x-as)",{"$f":"+C28","v":0},{"$f":"+C20","v":100},null,null,null,0.89999999999999991,359999.99999999994,45,0.89999999999999991,null,null,null,null,null,null,4.5,4.4999999999999998E-2,22.5,null,null,22.5,null,null,22.5,491000,491000,491000,null,null,65.5,75.5,85.5,95.5,105.5,115.5,125.49999999999999]
[null,"Winnaar","Evaluatie","Winnaar INFO BD","Score",null,null,null,null,null,null,0.99999999999999989,{"$f":"+M14","v":400000},50,0.99999999999999989,50,null,null,null,null,null,5,4.9999999999999996E-2,24.999999999999996,null,null,24.999999999999996,null,null,25,490000,490000,490000,null,null,65,75,85,95,105,114.99999999999999,125]
[null,{"$f":"IF(ISERROR(VLOOKUP(1,B51:E62,2,FALSE)),\"geen\",VLOOKUP(1,B51:E62,2,FALSE))","v":"geen"},null,{"$f":"'Info BD'!L7","v":"4"},{"$f":"VLOOKUP(1,$A$41:$F$45,6,FALSE)","v":727.5},"Toepassen",{"$f":"Dashboard!G9","v":0},null,null,null,null,1.0999999999999999,{"$f":"+$M$14*L33","v":439999.99999999994},55,1.0999999999999999,null,null,null,null,null,null,5.4999999999999991,5.4999999999999993E-2,27.499999999999996,null,null,27.499999999999996,null,null,27.5,489000,489000,489000,null,null,64.5,74.5,84.5,94.5,104.5,114.5,124.50000000000001]
[null," "," "," "," ","Laagste waarde",{"$f":"Dashboard!H15","v":300000},null,null,null,null,1.2,480000,60,1.2,null,null,null,null,null,null,5.9999999999999991,5.9999999999999991E-2,29.999999999999996,null,null,29.999999999999996,null,null,30,488000,488000,488000,null,null,64,74,84,94,104,113.99999999999999,124,null,null,null,"Toelichting symbolen: "]
[null,"Lijn X-as",0,100," ","Hoogste waarde",{"$f":"Dashboard!H14","v":500000},null,null,null,null,1.3,520000,65,1.3,null,null,null,null,null,null,6.4999999999999991,6.4999999999999988E-2,32.499999999999993,null,null,32.499999999999993,null,null,32.5,487000,487000,487000,null,null,63.5,73.5,83.5,93.5,103.49999999999999,113.5,123.50000000000001,null,null,null,"Pi = Vergelijkingswaarde Inschrijver; ",null,null,null,"Qmin = minimaal aantal punten (100); ",null,null,null,null,{"$f":"\"Pmax = bovengrens Prijs (\" &  BM6 & \"); \"","v":"Pmax = bovengrens Prijs (€500.000,00); "}]
[null,"Plafondprijs",{"$f":"+$C$8","v":400000},{"$f":"+$C$8","v":400000}," ","Voorbeeld Prijs",{"$f":"(+G34+G35)/2","v":400000},null,null,null,null,1.4000000000000001,560000,70,1.4000000000000001,null,null,null,null,null,null,6.9999999999999991,6.9999999999999993E-2,34.999999999999993,null,null,34.999999999999993,null,null,35,486000,486000,486000,null,null,63,73,83,93,103,112.99999999999999,123,null,null,null,"Qi = Kwaliteitsscore Inschrijver; ",null,null,null,{"$f":"\"Qmax = maximaal aantal punten (\" & BD7 & \"); \"","v":"Qmax = maximaal aantal punten (200); "},null,null,null,null,{"$f":"\"Pmin = ondergrens Prijs (\" &  BM7 & \"); \"","v":"Pmin = ondergrens Prijs (€300.000,00); "}]
[null,"Bovengrens",0,{"$f":"+C37","v":0}," ","Delta_1",1,0,null,null,null,1.5000000000000002,600000.00000000012,75,1.5000000000000002,null,null,null,null,null,null,7.5,7.4999999999999997E-2,37.5,null,null,37.5,null,null,37.5,485000,485000,485000,null,null,62.5,72.5,82.5,92.5,102.49999999999999,112.5,122.50000000000001,null,null,null,{"$f":"\"Wq = gewicht voor Kwaliteit (\" & AX6 &\"); \"","v":"Wq = gewicht voor Kwaliteit (50%); "},null,null,null,{"$f":"\"Qwensen = aantal punten voor de Wensen (\" & AX3 & \"); \"","v":"Qwensen = aantal punten voor de Wensen (500); "},null,null,null,null,{"$f":"\"SPmax = maximaal aantal punten voor Prijs (\"& BM8 & \"); \"","v":"SPmax = maximaal aantal punten voor Prijs (500); "}]
[null,"Ondergrens",0,{"$f":"+C38","v":0},null,"Qref",0.5,null,null,null,null,1.6000000000000003,640000.00000000012,80,1.6000000000000003,null,null,null,null,null,null,8,0.08,40,null,null,40,null,null,40,484000,484000,484000,null,null,62,72,82,92,102,112.00000000000001,122,null,null,null,{"$f":"\"Wp = gewicht voor Prijs (\" & AX7 & \"); \"","v":"Wp = gewicht voor Prijs (50%); "},null,null,null,"Q'i = aangepaste kwaliteitsscore Inschrijver; ",null,null,null,null,{"$f":"\"SPmin = minimaal aantal punten voor Prijs (=\"","v":"SPmin = minimaal aantal punten voor Prijs (="}]
[null,null,null,null,null,null,null,null,null,null,null,1.7000000000000004,680000.00000000012,85,1.7000000000000004,null,null,null,null,null,null,8.5,8.5000000000000006E-2,42.5,null,null,42.5,null,null,42.5,483000,483000,483000,null,null,61.5,71.5,81.5,91.5,101.49999999999999,111.5,121.50000000000001,null,null,null,{"$f":"\"n = \" & AX8 &\". \"","v":"n = 1,0. "},null,null,null,"Si = BPK-score Inschrijver; ",null,null,null,null,"SQi = behaalde score voor de Qwensen; "]
[null,"Ten behoeve van BD","Pi","Qi ","Q'i (norm)","BPK-score","Voor grafiek","KO","RANG",null,null,1.8000000000000005,720000.00000000023,90,1.8000000000000005,null,null,null,null,null,null,9.0000000000000018,9.0000000000000011E-2,45.000000000000007,null,null,45.000000000000007,null,null,45,482000,482000,482000,null,null,61,71,81,91,101,111.00000000000001,121]
[{"$f":"+I41","v":5},1,{"$f":"+'Info BD'!I19","v":385000},{"$f":"+'Info BD'!J19","v":338},{"$f":"IF($F$11<>\"n.v.t.\",$F$14+(D41/$C$6)*$F$11,\"n.v.t.\")","v":"n.v.t."},{"$f":"IF(H41=\"KO\",\"KO\",IF(E41<>\"n.v.t.\",C168,C168))","v":625.5},{"$f":"IF(E41=\"n.v.t.\",D41/$C$6*$F$13,E41)","v":67.600000000000009},{"$f":"IF(AND(C41<=$C$17,C41>=$C$14,D41>=$F$49),\"\",\"KO\")","v":""},{"$f":"IF(ISERROR(RANK(F41,$F$41:$F$45)),\"KO\",RANK(F41,$F$41:$F$45))","v":5},null,null,1.9000000000000006,760000.00000000023,95,1.9000000000000006,null,null,null,null,null,null,9.5000000000000018,9.5000000000000015E-2,47.500000000000007,null,null,47.500000000000007,null,null,47.5,481000,481000,481000,null,null,60.5,70.5,80.5,90.5,100.49999999999999,110.5,120.5,null,null,null,"De BPK-formule is ter verduidelijking in de grafiek weergegeven."]
[{"$f":"+I42","v":2},2,{"$f":"+'Info BD'!I20","v":360000},{"$f":"+'Info BD'!J20","v":363},{"$f":"IF($F$11<>\"n.v.t.\",$F$14+(D42/$C$6)*$F$11,\"n.v.t.\")","v":"n.v.t."},{"$f":"IF(H42=\"KO\",\"KO\",IF(E42<>\"n.v.t.\",C169,C169))","v":713},{"$f":"IF(E42=\"n.v.t.\",D42/$C$6*$F$13,E42)","v":72.599999999999994},{"$f":"IF(AND(C42<=$C$17,C42>=$C$14,D42>=$F$49),\"\",\"KO\")","v":""},{"$f":"IF(ISERROR(RANK(F42,$F$41:$F$45)),\"KO\",RANK(F42,$F$41:$F$45))","v":2},null,null,2.0000000000000004,800000.00000000023,100,2.0000000000000004,null,null,null,null,null,null,10.000000000000002,0.10000000000000002,50.000000000000007,null,null,50.000000000000007,null,null,50,480000,480000,480000,null,null,60,70,80,90,100,110.00000000000001,120]
[{"$f":"+I43","v":3},3,{"$f":"+'Info BD'!I21","v":405000},{"$f":"+'Info BD'!J21","v":450},{"$f":"IF($F$11<>\"n.v.t.\",$F$14+(D43/$C$6)*$F$11,\"n.v.t.\")","v":"n.v.t."},{"$f":"IF(H43=\"KO\",\"KO\",IF(E43<>\"n.v.t.\",C170,C170))","v":687.5},{"$f":"IF(E43=\"n.v.t.\",D43/$C$6*$F$13,E43)","v":90},{"$f":"IF(AND(C43<=$C$17,C43>=$C$14,D43>=$F$49),\"\",\"KO\")","v":""},{"$f":"IF(ISERROR(RANK(F43,$F$41:$F$45)),\"KO\",RANK(F43,$F$41:$F$45))","v":3},null,null,null,null,null,null,null,null,null,null,null,null,10.500000000000002,0.10500000000000002,52.500000000000014,null,null,52.500000000000014,null,null,52.5,479000,479000,479000,null,null,59.5,69.5,79.5,89.5,99.5,109.5,119.5]
[{"$f":"+I44","v":1},4,{"$f":"+'Info BD'!I22","v":379000},{"$f":"+'Info BD'!J22","v":425},{"$f":"IF($F$11<>\"n.v.t.\",$F$14+(D44/$C$6)*$F$11,\"n.v.t.\")","v":"n.v.t."},{"$f":"IF(H44=\"KO\",\"KO\",IF(E44<>\"n.v.t.\",C171,C171))","v":727.5},{"$f":"IF(E44=\"n.v.t.\",D44/$C$6*$F$13,E44)","v":85},{"$f":"IF(AND(C44<=$C$17,C44>=$C$14,D44>=$F$49),\"\",\"KO\")","v":""},{"$f":"IF(ISERROR(RANK(F44,$F$41:$F$45)),\"KO\",RANK(F44,$F$41:$F$45))","v":1},null,null,"Voor fixeren van de Y-as, gaat in model via macro",null,null,"X-as is genormaliseerd naar 0 - 100% kwaliteit",null,null,null,null,null,null,11.000000000000004,0.11000000000000003,55.000000000000014,null,null,55.000000000000014,null,null,55,478000,478000,478000,null,null,59,69,79,89,99,109.00000000000001,119]
[{"$f":"+I45","v":4},5,{"$f":"+'Info BD'!I23","v":400000},{"$f":"+'Info BD'!J23","v":388},{"$f":"IF($F$11<>\"n.v.t.\",$F$14+(D45/$C$6)*$F$11,\"n.v.t.\")","v":"n.v.t."},{"$f":"IF(H45=\"KO\",\"KO\",IF(E45<>\"n.v.t.\",C172,C172))","v":638},{"$f":"IF(E45=\"n.v.t.\",D45/$C$6*$F$13,E45)","v":77.600000000000009},{"$f":"IF(AND(C45<=$C$17,C45>=$C$14,D45>=$F$49),\"\",\"KO\")","v":""},{"$f":"IF(ISERROR(RANK(F45,$F$41:$F$45)),\"KO\",RANK(F45,$F$41:$F$45))","v":4},null,null,null,null,null,null,null,null,null,null,null,null,11.500000000000004,0.11500000000000003,57.500000000000014,null,null,57.500000000000014,null,null,57.5,477000,477000,477000,null,null,58.5,68.5,78.5,88.5,98.5,108.5,118.5,null,null,null,"xxxx"]
[" ",null,null,null,null,{"$f":"COUNT(F41:F45)","v":5},null,null,null,null,null,null,null,null,null,null,null,null,null,null,null,12.000000000000004,0.12000000000000004,60.000000000000021,null,null,60.000000000000021,null,null,60,476000,476000,476000,null,null,57.999999999999993,68,78,88,98,108,118,null,null,null,{"$f":"\"Als voorbeeld wordt in de grafiek een inschrijving getoond (oranje punt) met een BPK-score van \" &BD2 & \". \"","v":"Als voorbeeld wordt in de grafiek een inschrijving getoond (oranje punt) met een BPK-score van 500,0. "}]
[null,"Label","Gunningswaarde",null,null,null,null,null,null,null,null,null,null,null,null,null,null,null,null,null,null,12.500000000000004,0.12500000000000003,62.500000000000014,null,null,62.500000000000014,null,null,62.5,475000,475000,475000,null,null,57.499999999999993,67.5,77.5,87.5,97.5,107.5,117.5,null,null,null,{"$f":"\"Deze score geldt voor de volledige doorlopende donkeroranje lijn. \"","v":"Deze score geldt voor de volledige doorlopende donkeroranje lijn. "}]
[null,null,null,null,null,null,null,null,null,null,null,null,null,null,null,null,null,null,null,null,null,13.000000000000004,0.13000000000000003,65.000000000000014,null,null,65.000000000000014,null,null,65,474000,474000,474000,null,null,56.999999999999993,67,77,87,97,107,117,null,null,null,"Naar rechts toe duiden de oranje lijnen steeds betere scores aan. De BPK-scores worden afgerond op één decimaal. Indien twee inschrijvers exact dezelfde hoogste BPK-score behalen, wordt de gunning toegekend aan de inschrijver met de hoogste kwaliteitsscore."]
[null,"Evaluatie",null,"Budgetplafond ->",{"$f":"IF(+C13<0,\"n.v.t.\",+C13)","v":"n.v.t."},{"$f":"+Dashboard!H22","v":0},"<- Qknockout",null,null,null,null,null,null,null,null,null,null,null,null,null,null,13.500000000000004,0.13500000000000004,67.500000000000014,null,null,67.500000000000014,null,null,67.5,473000,473000,473000,null,null,56.499999999999993,66.5,76.5,86.5,96.5,106.5,116.5]
[null,"Rang","lev. #","lev. Naam","Pi","Qi","Qi (norm)","BPK-score","Voor grafiek","KO","RANG",null,null,null,null,null,null,null,null,null,null,14.000000000000004,0.14000000000000004,70.000000000000014,null,null,70.000000000000014,null,null,70,472000,472000,472000,null,null,56.000000000000007,66,76,86,96,106,115.99999999999999,null,null,null,"Ter illustratie zijn in de grafiek de scores van vijf Inschrijvers weergegeven. "]
[null,{"$f":"K51","v":"KO"},"1",{"$f":"IF(ISBLANK(+Evaluatie!E8),\"\",+Evaluatie!E8)","v":""},{"$f":"IF(ISBLANK(+Evaluatie!F8),\"\",+Evaluatie!F8)","v":""},{"$f":"IF(ISBLANK(+Evaluatie!G8),\"\",+Evaluatie!G8)","v":""},{"$f":"IF($F$11<>\"n.v.t.\",$F$14+(F51/$C$6)*$F$11,\"n.v.t.\")","v":"n.v.t."},{"$f":"IF(OR(E51=\"\",F51=\"\"),\"\",IF(J51=\"KO\",\"KO\",IF(G51<>\"n.v.t.\",C175,C175)))","v":""},{"$f":"IF(OR(E51=\"\",F51=\"\"),\"\",IF(G51=\"n.v.t.\",F51/$C$6*$F$13,G51))","v":""},{"$f":"IF(AND(E51<=$C$17,E51>=$C$14,F51>=$F$49),\"\",\"KO\")","v":"KO"},{"$f":"IF(ISERROR(RANK(H51,$H$51:$H$62)),\"KO\",RANK(H51,$H$51:$H$62))","v":"KO"},null,null,null,null,null,null,null,null,null,null,14.500000000000005,0.14500000000000005,72.500000000000028,null,null,72.500000000000028,null,null,72.5,471000,471000,471000,null,null,55.500000000000007,65.5,75.5,85.5,95.5,105.5,115.5,null,null,null,{"$f":"\"De winnende Inschrijver in dit voorbeeld is Inschrijver \" & BI2 & \", met een Vergelijkingswaarde (Pi) van \" & BI3 & \" en een kwaliteitsscore (Qi) van \"& BI4 &  \". \"","v":"De winnende Inschrijver in dit voorbeeld is Inschrijver 4, met een Vergelijkingswaarde (Pi) van €379.000,00 en een kwaliteitsscore (Qi) van 425,0. "}]
[null,"KO","2",{"$f":"IF(ISBLANK(+Evaluatie!E9),\"\",+Evaluatie!E9)","v":""},{"$f":"IF(ISBLANK(+Evaluatie!F9),\"\",+Evaluatie!F9)","v":""},{"$f":"IF(ISBLANK(+Evaluatie!G9),\"\",+Evaluatie!G9)","v":""},"n.v.t.","","","KO","KO",null,null,null,null,null,null,null,null,null,null,15.000000000000005,0.15000000000000005,75.000000000000028,null,null,75.000000000000028,null,null,75,470000,470000,470000,null,null,55.000000000000007,65,75,85,95,105,114.99999999999999,null,null,null,{"$f":" \"Dit levert de hoogste BPK-score op van \"& BI6 & \". De overige Inschrijvers hebben lagere BPK-scores variërend van \" & BI7 &  \" tot \"& BI8 & \").\"","v":"Dit levert de hoogste BPK-score op van 727,5. De overige Inschrijvers hebben lagere BPK-scores variërend van 713,0 tot 625,5)."}]
[null,"KO","3",{"$f":"IF(ISBLANK(+Evaluatie!E10),\"\",+Evaluatie!E10)","v":""},{"$f":"IF(ISBLANK(+Evaluatie!F10),\"\",+Evaluatie!F10)","v":""},{"$f":"IF(ISBLANK(+Evaluatie!G10),\"\",+Evaluatie!G10)","v":""},"n.v.t.","","","KO","KO",null,null,null,null,null,null,null,null,null,null,15.500000000000005,0.15500000000000005,77.500000000000028,null,null,77.500000000000028,null,null,77.5,469000,469000,469000,null,null,54.500000000000007,64.5,74.5,84.5,94.5,104.5,114.5]
[null,"KO","4",{"$f":"IF(ISBLANK(+Evaluatie!E11),\"\",+Evaluatie!E11)","v":""},{"$f":"IF(ISBLANK(+Evaluatie!F11),\"\",+Evaluatie!F11)","v":""},{"$f":"IF(ISBLANK(+Evaluatie!G11),\"\",+Evaluatie!G11)","v":""},"n.v.t.","","","KO","KO",null,null,null,null,null,null,null,null,null,null,{"$f":"$V$223*W54","v":16.000000000000007},0.16000000000000006,80.000000000000028,null,null,80.000000000000028,null,null,80,468000,468000,468000,null,null,54,64,74,84,94,104,113.99999999999999,null,null,null,"Ter extra ondersteuning is in bijlage X Prijzenformulier, in het tabblad ‘BPK-Grafiek’ de betreffende grafiek opgenomen. Op basis van de vergelijkingswaarde (Pi) en een eigen inschatting van de kwaliteitsscore (Qi) kan de Inschrijver zijn eigen positie indicatief in de grafiek bepalen."]
[null,"KO","5",{"$f":"IF(ISBLANK(+Evaluatie!E12),\"\",+Evaluatie!E12)","v":""},{"$f":"IF(ISBLANK(+Evaluatie!F12),\"\",+Evaluatie!F12)","v":""},{"$f":"IF(ISBLANK(+Evaluatie!G12),\"\",+Evaluatie!G12)","v":""},"n.v.t.","","","KO","KO",null,null,null,null,null,null,null,null,null,null,16.500000000000007,0.16500000000000006,{"$f":"+W55*($X$223-$F$14)+$X$22","v":82.500000000000028},null,null,82.500000000000028,null,null,82.5,467000,467000,467000,null,null,53.5,63.5,73.5,83.5,93.5,103.49999999999999,113.5]
[null,"KO","6",{"$f":"IF(ISBLANK(+Evaluatie!E13),\"\",+Evaluatie!E13)","v":""},{"$f":"IF(ISBLANK(+Evaluatie!F13),\"\",+Evaluatie!F13)","v":""},{"$f":"IF(ISBLANK(+Evaluatie!G13),\"\",+Evaluatie!G13)","v":""},"n.v.t.","","","KO","KO",null,null,null,null,null,null,null,null,null,null,17.000000000000007,0.17000000000000007,85.000000000000028,null,null,85.000000000000028,null,null,85,466000,466000,466000,null,null,53,63,73,83,93,103,112.99999999999999]
[null,"KO","7",{"$f":"IF(ISBLANK(+Evaluatie!E14),\"\",+Evaluatie!E14)","v":""},{"$f":"IF(ISBLANK(+Evaluatie!F14),\"\",+Evaluatie!F14)","v":""},{"$f":"IF(ISBLANK(+Evaluatie!G14),\"\",+Evaluatie!G14)","v":""},"n.v.t.","","","KO","KO",null,null,null,null,null,null,null,null,null,null,17.500000000000007,0.17500000000000007,87.500000000000043,null,null,87.500000000000043,null,null,87.5,465000,465000,465000,null,null,52.5,62.5,72.5,82.5,92.5,102.49999999999999,112.5]
[null,"KO","8",{"$f":"IF(ISBLANK(+Evaluatie!E15),\"\",+Evaluatie!E15)","v":""},{"$f":"IF(ISBLANK(+Evaluatie!F15),\"\",+Evaluatie!F15)","v":""},{"$f":"IF(ISBLANK(+Evaluatie!G15),\"\",+Evaluatie!G15)","v":""},"n.v.t.","","","KO","KO",null,null,null,null,null,null,null,null,null,null,18.000000000000007,0.18000000000000008,90.000000000000043,null,null,90.000000000000043,null,null,90,464000,464000,464000,null,null,52,62,72,82,92,102,112.00000000000001]
[null,"KO","9",{"$f":"IF(ISBLANK(+Evaluatie!E16),\"\",+Evaluatie!E16)","v":""},{"$f":"IF(ISBLANK(+Evaluatie!F16),\"\",+Evaluatie!F16)","v":""},{"$f":"IF(ISBLANK(+Evaluatie!G16),\"\",+Evaluatie!G16)","v":""},"n.v.t.","","","KO","KO",null,null,null,null,null,null,null,null,null,null,18.500000000000007,0.18500000000000008,92.500000000000043,null,null,92.500000000000043,null,null,92.5,463000,463000,463000,null,null,51.5,61.5,71.5,81.5,91.5,101.49999999999999,111.5]
[null,"KO","10",{"$f":"IF(ISBLANK(+Evaluatie!E17),\"\",+Evaluatie!E17)","v":""},{"$f":"IF(ISBLANK(+Evaluatie!F17),\"\",+Evaluatie!F17)","v":""},{"$f":"IF(ISBLANK(+Evaluatie!G17),\"\",+Evaluatie!G17)","v":""},"n.v.t.","","","KO","KO",null,null,null,null,null,null,null,null,null,null,19.000000000000007,0.19000000000000009,95.000000000000043,null,null,95.000000000000043,null,null,95,462000,462000,462000,null,null,51,61,71,81,91,101,111.00000000000001]
[null,"KO","11",{"$f":"IF(ISBLANK(+Evaluatie!E18),\"\",+Evaluatie!E18)","v":""},{"$f":"IF(ISBLANK(+Evaluatie!F18),\"\",+Evaluatie!F18)","v":""},{"$f":"IF(ISBLANK(+Evaluatie!G18),\"\",+Evaluatie!G18)","v":""},"n.v.t.","","",{"$f":"IF(AND(E61<=$C$17,E61>=$C$14,F61>=$F$49),\"\",\"KO\")","v":"KO"},"KO",null,null,null,null,null,null,null,null,null,null,19.500000000000011,0.19500000000000009,97.500000000000043,null,null,97.500000000000043,null,null,97.5,461000,461000,461000,null,null,50.5,60.5,70.5,80.5,90.5,100.49999999999999,110.5]
[null,"KO","12",{"$f":"IF(ISBLANK(+Evaluatie!E19),\"\",+Evaluatie!E19)","v":""},{"$f":"IF(ISBLANK(+Evaluatie!F19),\"\",+Evaluatie!F19)","v":""},{"$f":"IF(ISBLANK(+Evaluatie!G19),\"\",+Evaluatie!G19)","v":""},"n.v.t.","","",{"$f":"IF(AND(E62<=$C$17,E62>=$C$14,F62>=$F$49),\"\",\"KO\")","v":"KO"},"KO",null,null,null,null,null,null,null,null,null,null,20.000000000000011,0.20000000000000009,100.00000000000004,null,null,100.00000000000004,null,null,100,460000,460000,460000,null,null,50,60,70,80,90,100,110.00000000000001,null,null,null,"Minimale score kwaliteit Inschrijver "]
[null," ",null,"Referentie",{"$f":"+$C$8","v":400000},{"$f":"IF(ISBLANK(+Evaluatie!G20),\"\",+Evaluatie!G20)","v":250},"n.v.t.",{"$f":"M16","v":500},{"$f":"IF(G63=\"n.v.t.\",F63/$C$6*$F$13,G63)","v":50},{"$f":"IF(OR(E63>$E$49,F63<$F$49),\"KO\",\"\")","v":""}," ",null,null,null,null,null,null,null,null,null,null,20.500000000000011,0.2050000000000001,102.50000000000004,null,null,102.50000000000004,null,null,102.5,459000,459000,459000,null,null,49.5,59.5,69.5,79.5,89.5,99.5,109.5,null,null,null,"De Lowest Acceptable Quality (LAQ) verwijst naar het minimale aantal kwaliteitspunten dat een inschrijving moet behalen om in aanmerking te komen voor gunning. "]
[null,null,null,null,null,null,"Aantal",{"$f":"COUNT(H51:H62)","v":0},null,null,null,null,null,null,null,null,null,null,null,null,null,21.000000000000011,0.2100000000000001,105.00000000000006,null,null,105.00000000000006,null,null,105,458000,458000,458000,null,null,49,59,69,79,89,99,109.00000000000001,null,null,null,{"$f":"\"Dit minimum is vastgesteld op \"&BM2&\" punten van de in totaal \"&AX3&\" te verdienen punten. \"","v":"Dit minimum is vastgesteld op 0 punten van de in totaal 500 te verdienen punten. "}]
[null,null,null,null,null,null,null,null,null,null,null,null,null,null,null,null,null,null,null,null,null,21.500000000000011,0.21500000000000011,107.50000000000006,null,null,107.50000000000006,null,null,107.5,457000,457000,457000,null,null,48.5,58.5,68.5,78.5,88.5,98.5,108.5]
[null,null,null,null,null,null,null,null,null,null,null,null,null,null,null,null,null,null,null,null,null,22.000000000000011,0.22000000000000011,110.00000000000006,null,null,110.00000000000006,null,null,110,456000,456000,456000,null,null,48,57.999999999999993,68,78,88,98,108]
[null,"Adapted' variant",null,null,null,"Notatie Varabelen",null,null,null,null,null,null,null,null,null,null,null,null,null,null,null,22.500000000000011,{"$f":"+W66+0.005","v":0.22500000000000012},112.50000000000006,null,null,112.50000000000006,null,null,112.5,455000,455000,455000,null,null,47.5,57.499999999999993,67.5,77.5,87.5,97.5,107.5]
[null,null,null,null,null,"Qvbi",null,null,null,null,null,null,null,null,null,null,null,null,null,null,null,23.000000000000011,0.23000000000000012,115.00000000000006,null,null,115.00000000000006,null,null,115,454000,454000,454000,null,null,47,56.999999999999993,67,77,87,97,107]
[null,"Maximaal in Procenten",{"$f":"100*(1+Dashboard!G14)","v":100},null,null,"SQmax",null,null,null,null,null,null,null,null,null,null,null,null,null,null,null,23.500000000000014,0.23500000000000013,117.50000000000006,null,null,117.50000000000006,null,null,117.5,453000,453000,453000,null,null,46.5,56.499999999999993,66.5,76.5,86.5,96.5,106.5]
[null,null,null,null,null,null,null,null,null,null,null,null,null,null,null,null,null,null,null,null,null,24.000000000000014,0.24000000000000013,120.00000000000007,null,null,120.00000000000007,null,null,120,452000,452000,452000,null,null,46,56.000000000000007,66,76,86,96,106]
[null,null,null,null,null,null,null,null,null,null,null,null,null,null,null,null,null,null,null,null,null,24.500000000000014,0.24500000000000013,122.50000000000007,null,null,122.50000000000007,null,null,122.5,451000,451000,451000,null,null,45.5,55.500000000000007,65.5,75.5,85.5,95.5,105.5]
[null,null,null,null,null,null,null,null,null,null,null,null,null,null,null,null,null,null,null,null,null,25.000000000000011,0.25000000000000011,125.00000000000006,null,null,125.00000000000006,null,null,125,450000,450000,450000,null,null,45,55.000000000000007,65,75,85,95,105]
[null,null,null,null,null,null,null,null,null,null,null,null,null,null,null,null,null,null,null,null,null,25.500000000000011,0.25500000000000012,127.50000000000006,null,null,127.50000000000006,null,null,127.5,449000,449000,449000,null,null,44.5,54.500000000000007,64.5,74.5,84.5,94.5,104.5]
[null,"Stappen hulplijnen",null,null,null,null,null,null,null,null,null,null,null,null,null,null,null,null,null,null,null,26.000000000000011,0.26000000000000012,130.00000000000006,null,null,130.00000000000006,null,null,130,448000,448000,448000,null,null,44,54,64,74,84,94,104]
[null,"Qreferentie",{"$f":"+Dashboard!H19","v":250},null,null,null,null,null,null,null,null,null,null,null,null,null,null,null,null,null,null,26.500000000000014,0.26500000000000012,132.50000000000006,null,null,132.50000000000006,null,null,132.5,447000,447000,447000,null,null,43.5,53.5,63.5,73.5,83.5,93.5,103.49999999999999,null,null,null,"Grafiek"]
[null,"Maximaal",{"$f":"+C69","v":100},null,null,null,null,null,null,null,null,null,null,null,null,null,null,null,null,null,null,27.000000000000014,0.27000000000000013,135.00000000000006,null,null,135.00000000000006,null,null,135,446000,446000,446000,null,null,43,53,63,73,83,93,103]
[null,null,{"$f":"+C76-C75","v":-150},null,null,null,null,null,null,null,null,null,null,null,null,null,null,null,null,null,null,27.500000000000014,0.27500000000000013,137.50000000000006,null,null,137.50000000000006,null,null,137.5,445000,445000,445000,null,null,42.5,52.5,62.5,72.5,82.5,92.5,102.49999999999999]
[null,"Stappen",{"$f":"ROUND(C76/8,0)","v":13},null,null,null,null,null,null,null,null,null,null,null,null,null,null,null,null,null,null,28.000000000000014,0.28000000000000014,140.00000000000006,null,null,140.00000000000006,null,null,140,444000,444000,444000,null,null,42,52,62,72,82,92,102]
[null,null,null,null,null,null,null,null,null,null,null,null,null,null,null,null,null,null,null,null,null,28.500000000000014,0.28500000000000014,142.50000000000006,null,null,142.50000000000006,null,null,142.5,443000,443000,443000,null,null,41.5,51.5,61.5,71.5,81.5,91.5,101.49999999999999]
[null,"Qref",{"$f":"C12","v":250},null,null,null,null,null,null,null,null,null,null,null,null,null,null,null,null,null,null,29.000000000000014,0.29000000000000015,145.00000000000009,null,null,145.00000000000009,null,null,145,442000,442000,442000,null,null,41,51,61,71,81,91,101]
[null,null,{"$f":"+C80*2","v":500},null,null,null,null,null,null,null,null,null,null,null,null,null,null,null,null,null,null,29.500000000000014,0.29500000000000015,147.50000000000009,null,null,147.50000000000009,null,null,147.5,441000,441000,441000,null,null,40.5,50.5,60.5,70.5,80.5,90.5,100.49999999999999]
[null,null,null,null,null,null,null,null,null,null,null,null,null,null,null,null,null,null,null,null,null,30.000000000000014,0.30000000000000016,150.00000000000009,null,null,150.00000000000009,null,null,150,440000,440000,440000,null,null,40,50,60,70,80,90,100]
[null,null,null,null,null,null,null,null,null,null,null,null,null,null,null,null,null,null,null,null,null,30.500000000000014,0.30500000000000016,152.50000000000009,null,null,152.50000000000009,null,null,152.5,439000,439000,439000,null,null,39.5,49.5,59.5,69.5,79.5,89.5,99.5]
[null,"Hulpveld voor apartzetten van Evaluatietabblad",null,null,null,null,null,null,null,null,null,null,null,null,null,null,null,null,null,null,null,31.000000000000018,0.31000000000000016,155.00000000000009,null,null,155.00000000000009,null,null,155,438000,438000,438000,null,null,39,49,59,69,79,89,99]
[null,null,null,null,"Qi",null,null,null,null,null,null,null,null,null,null,null,null,null,null,null,null,31.500000000000018,0.31500000000000017,157.50000000000009,null,null,157.50000000000009,null,null,157.5,437000,437000,437000,null,null,38.5,48.5,58.5,68.5,78.5,88.5,98.5]
[null,"#","Inschrijver","Pi",null,"in %","SCOREi","Rang-\norde",null,null,null,null,null,null,null,null,null,null,null,null,null,{"$f":"$V$223*W86","v":32.000000000000014},0.32000000000000017,160.00000000000009,null,null,160.00000000000009,null,null,160,436000,436000,436000,null,null,38,48,57.999999999999993,68,78,88,98]
[null,"1",{"$f":"+Evaluatie!$E$8","v":0},{"$f":"+Evaluatie!$F$8","v":0},{"$f":"+Evaluatie!$G$8","v":0},{"$f":"+Evaluatie!$H$8","v":""},{"$f":"C175","v":1250},{"$f":"+Evaluatie!$J$8","v":""},null,null,null,null,null,null,null,null,null,null,null,null,null,32.500000000000014,0.32500000000000018,{"$f":"+W87*($X$223-$F$14)+$X$22","v":162.50000000000009},null,null,162.50000000000009,null,null,162.5,{"$f":"IF($E$6=\"Wortelformule\",AF87,AG87)","v":435000},{"$f":"$C$17-(AD87^$H$7)*($C$17-$C$14)/($H$6^$H$7)","v":435000},{"$f":"$C$14+($C$17-$C$14)*(($H$6-AD87)/$H$6)^(1/$H$7)","v":435000},null,null,{"$f":"(($AJ$19-AD87)/$H$5)*100","v":37.5},{"$f":"(($AK$19-AD87)/$H$5)*100","v":47.5},{"$f":"(($AL$19-AD87)/$H$5)*100","v":57.499999999999993},{"$f":"(($AM$19-AD87)/$H$5)*100","v":67.5},{"$f":"(($AN$19-AD87)/$H$5)*100","v":77.5},{"$f":"(($AO$19-AD87)/$H$5)*100","v":87.5},{"$f":"(($AP$19-AD87)/$H$5)*100","v":97.5}]
[null,"2",{"$f":"+Evaluatie!$E$9","v":0},{"$f":"+Evaluatie!$F$9","v":0},{"$f":"+Evaluatie!$G$9","v":0},{"$f":"+Evaluatie!$H$9","v":""},1250,{"$f":"+Evaluatie!$J$9","v":""},null,null,null,null,null,null,null,null,null,null,null,null,null,33.000000000000021,{"$f":"+W87+0.005","v":0.33000000000000018},165.00000000000009,null,null,{"$f":"+X88","v":165.00000000000009},null,null,{"$f":"+AD87+($H$6/200)","v":165},434000,434000,434000,null,null,37,47,56.999999999999993,67,77,87,97]
[null,"3",{"$f":"+Evaluatie!$E$10","v":0},{"$f":"+Evaluatie!$F$10","v":0},{"$f":"+Evaluatie!$G$10","v":0},{"$f":"+Evaluatie!$H$10","v":""},1250,{"$f":"+Evaluatie!$J$10","v":""},null,null,null,null,null,null,null,null,null,null,null,null,null,33.500000000000021,0.33500000000000019,167.50000000000009,null,null,167.50000000000009,null,null,167.5,433000,433000,433000,null,null,36.5,46.5,56.499999999999993,66.5,76.5,86.5,96.5]
[null,"4",{"$f":"+Evaluatie!$E$11","v":0},{"$f":"+Evaluatie!$F$11","v":0},{"$f":"+Evaluatie!$G$11","v":0},{"$f":"+Evaluatie!$H$11","v":""},1250,{"$f":"+Evaluatie!$J$11","v":""},null,null,null,null,null,null,null,null,null,null,null,null,null,34.000000000000021,0.34000000000000019,170.00000000000009,null,null,170.00000000000009,null,null,170,432000,432000,432000,null,null,36,46,56.000000000000007,66,76,86,96]
[null,"5",{"$f":"+Evaluatie!$E$12","v":0},{"$f":"+Evaluatie!$F$12","v":0},{"$f":"+Evaluatie!$G$12","v":0},{"$f":"+Evaluatie!$H$12","v":""},1250,{"$f":"+Evaluatie!$J$12","v":""},null,null,null,null,null,null,null,null,null,null,null,null,null,34.500000000000021,0.3450000000000002,172.50000000000009,null,null,172.50000000000009,null,null,172.5,431000,431000,431000,null,null,35.5,45.5,55.500000000000007,65.5,75.5,85.5,95.5]
[null,"6",{"$f":"+Evaluatie!$E$13","v":0},{"$f":"+Evaluatie!$F$13","v":0},{"$f":"+Evaluatie!$G$13","v":0},{"$f":"+Evaluatie!$H$13","v":""},1250,{"$f":"+Evaluatie!$J$13","v":""},null,null,null,null,null,null,null,null,null,null,null,null,null,35.000000000000021,0.3500000000000002,175.00000000000011,null,null,175.00000000000011,null,null,175,430000,430000,430000,null,null,35,45,55.000000000000007,65,75,85,95]
[null,"7",{"$f":"+Evaluatie!$E$14","v":0},{"$f":"+Evaluatie!$F$14","v":0},{"$f":"+Evaluatie!$G$14","v":0},{"$f":"+Evaluatie!$H$14","v":""},1250,{"$f":"+Evaluatie!$J$14","v":""},null,null,null,null,null,null,null,null,null,null,null,null,null,35.500000000000021,0.3550000000000002,177.50000000000011,null,null,177.50000000000011,null,null,177.5,429000,429000,429000,null,null,34.5,44.5,54.500000000000007,64.5,74.5,84.5,94.5]
[null,"8",{"$f":"+Evaluatie!$E$15","v":0},{"$f":"+Evaluatie!$F$15","v":0},{"$f":"+Evaluatie!$G$15","v":0},{"$f":"+Evaluatie!$H$15","v":""},1250,{"$f":"+Evaluatie!$J$15","v":""},null,null,null,null,null,null,null,null,null,null,null,null,null,36.000000000000021,0.36000000000000021,180.00000000000011,null,null,180.00000000000011,null,null,180,428000,428000,428000,null,null,34,44,54,64,74,84,94]
[null,"9",{"$f":"+Evaluatie!$E$16","v":0},{"$f":"+Evaluatie!$F$16","v":0},{"$f":"+Evaluatie!$G$16","v":0},{"$f":"+Evaluatie!$H$16","v":""},1250,{"$f":"+Evaluatie!$J$16","v":""},null,null,null,null,null,null,null,null,null,null,null,null,null,36.500000000000021,0.36500000000000021,182.50000000000011,null,null,182.50000000000011,null,null,182.5,427000,427000,427000,null,null,33.5,43.5,53.5,63.5,73.5,83.5,93.5]
[null,"10",{"$f":"+Evaluatie!$E$17","v":0},{"$f":"+Evaluatie!$F$17","v":0},{"$f":"+Evaluatie!$G$17","v":0},{"$f":"+Evaluatie!$H$17","v":""},1250,{"$f":"+Evaluatie!$J$17","v":""},null,null,null,null,null,null,null,null,null,null,null,null,null,37.000000000000021,0.37000000000000022,185.00000000000011,null,null,185.00000000000011,null,null,185,426000,426000,426000,null,null,33,43,53,63,73,83,93]
[null,"11",{"$f":"+Evaluatie!$E$18","v":0},{"$f":"+Evaluatie!$F$18","v":0},{"$f":"+Evaluatie!$G$18","v":0},{"$f":"+Evaluatie!$H$18","v":""},1250,{"$f":"+Evaluatie!$J$18","v":""},null,null,null,null,null,null,null,null,null,null,null,null,null,37.500000000000021,0.37500000000000022,187.50000000000011,null,null,187.50000000000011,null,null,187.5,425000,425000,425000,null,null,32.5,42.5,52.5,62.5,72.5,82.5,92.5]
[null,"12",{"$f":"+Evaluatie!$E$19","v":0},{"$f":"+Evaluatie!$F$19","v":0},{"$f":"+Evaluatie!$G$19","v":0},{"$f":"+Evaluatie!$H$19","v":""},1250,{"$f":"+Evaluatie!$J$19","v":""},null,null,null,null,null,null,null,null,null,null,null,null,null,38.000000000000021,0.38000000000000023,190.00000000000011,null,null,190.00000000000011,null,null,190,424000,424000,424000,null,null,32,42,52,62,72,82,92]
[null,null,{"$f":"+Evaluatie!$E$20","v":"Referentie"},{"$f":"+'HULP-velden'!$C$8","v":400000},{"$f":"+'HULP-velden'!$C$12","v":250},{"$f":"+Evaluatie!$H$20","v":50},{"$f":"+Evaluatie!$I$20","v":500},null,null,null,null,null,null,null,null,null,null,null,null,null,null,38.500000000000021,0.38500000000000023,192.50000000000011,null,null,192.50000000000011,null,null,192.5,423000,423000,423000,null,null,31.5,41.5,51.5,61.5,71.5,81.5,91.5]
[null,null,null,null,null,null,null,null,null,null,null,null,null,null,null,null,null,null,null,null,null,39.000000000000021,0.39000000000000024,195.00000000000011,null,null,195.00000000000011,null,null,195,422000,422000,422000,null,null,31,41,51,61,71,81,91]
[null,null,null,null,null,null,null,null,null,null,null,null,null,null,null,null,null,null,null,null,null,39.500000000000021,{"$f":"+W100+0.005","v":0.39500000000000024},197.50000000000011,null,null,197.50000000000011,null,null,197.5,421000,421000,421000,null,null,30.5,40.5,50.5,60.5,70.5,80.5,90.5]
[null,"Hulpvelden voor grafiek  (as-label)",null,null,null,null,null,null,null,null,null,null,null,null,null,null,null,null,null,null,null,40.000000000000021,0.40000000000000024,200.00000000000011,null,null,200.00000000000011,null,null,200,420000,420000,420000,null,null,30,40,50,60,70,80,90]
[null,null,"X-as","Y-as",null,null,null,null,null,null,null,null,null,null,null,null,null,null,null,null,null,40.500000000000028,0.40500000000000025,202.50000000000011,null,null,202.50000000000011,null,null,202.5,419000,419000,419000,null,null,29.5,39.5,49.5,59.5,69.5,79.5,89.5]
[null,"ondergrens",0,{"$f":"D113-D115","v":280000},null,null,null,null,null,null,null,null,null,null,null,null,null,null,null,null,null,41.000000000000028,0.41000000000000025,205.00000000000011,null,null,205.00000000000011,null,null,205,418000,418000,418000,null,null,28.999999999999996,39,49,59,69,79,89]
[null,"bovengrens",{"$f":"+C69","v":100},{"$f":"D114+D115","v":520000},null,null,null,null,null,null,null,null,null,null,null,null,null,null,null,null,null,41.500000000000028,0.41500000000000026,207.50000000000014,null,null,207.50000000000014,null,null,207.5,417000,417000,417000,null,null,28.499999999999996,38.5,48.5,58.5,68.5,78.5,88.5]
[null,"primaire eenheid",{"$f":"25","v":25},{"$f":"+E115","v":20000},null,null,null,null,null,null,null,null,null,null,null,null,null,null,null,null,null,42.000000000000028,0.42000000000000026,210.00000000000014,null,null,210.00000000000014,null,null,210,416000,416000,416000,null,null,28.000000000000004,38,48,57.999999999999993,68,78,88]
[null,null,null,null,null,null,null,null,null,null,null,null,null,null,null,null,null,null,null,null,null,42.500000000000028,0.42500000000000027,212.50000000000014,null,null,212.50000000000014,null,null,212.5,415000,415000,415000,null,null,27.500000000000004,37.5,47.5,57.499999999999993,67.5,77.5,87.5]
[null,"adapted ",null,0,0,null,null,null,null,null,null,null,null,null,null,null,null,null,null,null,null,43.000000000000028,0.43000000000000027,215.00000000000014,null,null,215.00000000000014,null,null,215,414000,414000,414000,null,null,27,37,47,56.999999999999993,67,77,87]
[null,null,null,0,100,null,null,null,null,null,null,null,null,null,null,null,null,null,null,null,null,43.500000000000028,0.43500000000000028,217.50000000000014,null,null,217.50000000000014,null,null,217.5,413000,413000,413000,null,null,26.5,36.5,46.5,56.499999999999993,66.5,76.5,86.5]
[null,null,null,null,null,null,null,null,null,null,null,null,null,null,null,null,null,null,null,null,null,44.000000000000028,0.44000000000000028,220.00000000000014,null,null,220.00000000000014,null,null,220,412000,412000,412000,null,null,26,36,46,56.000000000000007,66,76,86]
[null,null,{"$f":"+D111","v":800000},{"$f":"MROUND(C8*2,10000)","v":800000},null,null,null,null,null,null,null,null,null,null,null,null,null,null,null,null,null,44.500000000000028,0.44500000000000028,222.50000000000014,null,null,222.50000000000014,null,null,222.5,411000,411000,411000,null,null,25.5,35.5,45.5,55.500000000000007,65.5,75.5,85.5]
[null,null,null,null,null,null,null,null,null,null,null,null,null,null,null,null,null,null,null,null,null,45.000000000000028,0.45000000000000029,225.00000000000014,null,null,225.00000000000014,null,null,225,410000,410000,410000,null,null,25,35,45,55.000000000000007,65,75,85]
[null,"Hoogste verwachte waarde",null,{"$f":"Dashboard!H15","v":300000},null,null,null,null,null,null,null,null,null,null,null,null,null,null,null,null,null,45.500000000000028,0.45500000000000029,227.50000000000014,null,null,227.50000000000014,null,null,227.5,409000,409000,409000,null,null,24.5,34.5,44.5,54.500000000000007,64.5,74.5,84.5]
[null,"Laagste verwachte waarde",null,{"$f":"Dashboard!H14","v":500000},null,null,null,null,null,null,null,null,null,null,null,null,null,null,null,null,null,46.000000000000028,0.4600000000000003,230.00000000000014,null,null,230.00000000000014,null,null,230,408000,408000,408000,null,null,24,34,44,54,64,74,84]
[null,null,null,{"$f":"(+D114-D113)/10","v":20000},{"$f":"+D115","v":20000},null,null,null,null,null,null,null,null,null,null,null,null,null,null,null,null,46.500000000000028,0.4650000000000003,232.50000000000014,null,null,232.50000000000014,null,null,232.5,407000,407000,407000,null,null,23.5,33.5,43.5,53.5,63.5,73.5,83.5]
[null,null,null,null,null,null,null,null,null,null,null,null,null,"Hoogste",{"$f":"100%-0.05","v":0.95},{"$f":"L139","v":500},null,null,null,null,null,47.000000000000028,0.47000000000000031,235.00000000000014,null,null,235.00000000000014,null,null,235,406000,406000,406000,null,null,23,33,43,53,63,73,83]
[null,null,"Maxwaarde",{"$f":"MAX(Dashboard!H15,Dashboard!H14,Dashboard!H18,Dashboard!#REF!,D118)","v":{"$error":"#REF!"}},null,null,null,null,null,null,null,null,null,"Laagste",{"$f":"Scenarioanalyse!H22/Dashboard!H10","v":0.4},{"$f":"L138","v":200},null,null,null,null,null,47.500000000000028,0.47500000000000031,237.50000000000014,null,null,237.50000000000014,null,null,237.5,405000,405000,405000,null,null,22.5,32.5,42.5,52.5,62.5,72.5,82.5]
[null,null,"2 maal Pvbo",{"$f":"2*Dashboard!H18","v":800000},null,null,null,null,null,null,null,null,null,"Verschil",{"$f":"(+O116-O117)/11","v":4.9999999999999996E-2},{"$f":"(+P116-P117)/11","v":27.272727272727273},null,null,{"$f":"(O118*L139)","v":24.999999999999996},null,null,{"$f":"$V$223*W118","v":48.000000000000028},0.48000000000000032,240.00000000000017,null,null,240.00000000000017,null,null,240,404000,404000,404000,null,null,22,32,42,52,62,72,82]
[null,null,"Budgetplafond",{"$f":"Dashboard!#REF!","v":{"$error":"#REF!"}},null,null,null,null,null,null,null,null,null,null,null,null,null,null,null,null,null,48.500000000000028,0.48500000000000032,{"$f":"+W119*($X$223-$F$14)+$X$22","v":242.50000000000017},null,null,242.50000000000017,null,null,242.5,403000,403000,403000,null,null,21.5,31.5,41.5,51.5,61.5,71.5,81.5]
[null,null,null,null,null,null,null,null,null,null,null,null,null,null,null,null,null,null,null,null,null,49.000000000000036,0.49000000000000032,245.00000000000017,null,null,245.00000000000017,null,null,245,402000,402000,402000,null,null,21,31,41,51,61,71,81]
[null,null,null,null,null,null,null,null,null,null,null,null,null,null,null,null,null,null,null,null,null,49.500000000000036,0.49500000000000033,247.50000000000017,null,null,247.50000000000017,null,null,247.5,401000,401000,401000,null,null,20.5,30.5,40.5,50.5,60.5,70.5,80.5]
["Rang","Scenario analyse","Budgetplafond ->",null,null,{"$f":"IF(+C13<0,\"n.v.t.\",+C13)","v":"n.v.t."},null,null,{"$f":"Dashboard!H22","v":0},"<- Qknockout",null,null,null,null,null,null,null,null,null,null,null,50.000000000000036,0.50000000000000033,250.00000000000017,null,null,250.00000000000017,null,null,250,400000,400000,400000,null,null,20,30,40,50,60,70,80]
[null,"nummer","lev. Naam","Aanbodlijn","Eigen","Pi (grafiek)","Aanbodlijn","Eigen","Qi (grafiek)","Qi (norm)","BPK-score","Voor grafiek","KO","RANG",null,null,null,"X-as","Percentages",null,null,50.500000000000036,0.50500000000000034,252.50000000000017,null,null,252.50000000000017,null,null,252.5,399000,399000,399000,null,null,19.5,29.5,39.5,49.5,59.5,69.5,79.5]
[{"$f":"N124","v":12},"1",{"$f":"+Scenarioanalyse!D8","v":"Combinatie P/Q (1)"},{"$f":"$L$141","v":500000},{"$f":"+Scenarioanalyse!G8","v":0},{"$f":"IF(Scenarioanalyse!E8=\"nee\",\"\",IF(E124<>0,E124,D124))","v":500000},{"$f":"ROUND(IF(Scenarioanalyse!E8=\"nee\",\"\",+P124),2)","v":475},{"$f":"+Scenarioanalyse!I8","v":0},{"$f":"IF(H124<>0,H124,G124)","v":475},{"$f":"IF($F$11<>\"n.v.t.\",$F$14+(I124/$C$6)*$F$11,\"n.v.t.\")","v":"n.v.t."},{"$f":"IF(OR(F124=\"\",I124=\"\"),\"\",IF(M124=\"KO\",\"KO\",IF(J124<>\"n.v.t.\",C150,C150)))","v":475},{"$f":"I124*(100/$L$139)","v":95},{"$f":"IF(OR(F124>$F$122,I124<$I$122),\"KO\",\"\")","v":""},{"$f":"IF(ISERROR(RANK(K124,$K$124:$K$135)),\"KO\",RANK(K124,$K$124:$K$135))","v":12},{"$f":"O116","v":0.95},{"$f":"O124*$L$139","v":475},null,100,1,null,null,51.000000000000036,0.51000000000000034,255.00000000000017,null,null,255.00000000000017,null,null,255,398000,398000,398000,null,null,19,28.999999999999996,39,49,59,69,79,null,null,null,"Teksten voor Informatieknoppen"]
[{"$f":"N125","v":11},"2",{"$f":"+Scenarioanalyse!D9","v":"Combinatie P/Q (2)"},{"$f":"D124-$M$141","v":481818.18181818182},{"$f":"+Scenarioanalyse!G9","v":0},{"$f":"IF(Scenarioanalyse!E9=\"nee\",\"\",IF(E125<>0,E125,D125))","v":481818.18181818182},{"$f":"ROUND(IF(Scenarioanalyse!E9=\"nee\",\"\",+P125),2)","v":450},{"$f":"+Scenarioanalyse!I9","v":0},{"$f":"IF(H125<>0,H125,G125)","v":450},{"$f":"IF($F$11<>\"n.v.t.\",$F$14+(I125/$C$6)*$F$11,\"n.v.t.\")","v":"n.v.t."},{"$f":"IF(OR(F125=\"\",I125=\"\"),\"\",IF(M125=\"KO\",\"KO\",IF(J125<>\"n.v.t.\",C151,C151)))","v":495.5},{"$f":"I125*(100/$L$139)","v":90},{"$f":"IF(OR(F125>$E$49,I125<$F$49),\"KO\",\"\")","v":""},11,{"$f":"+O124-$O$118","v":0.89999999999999991},449.99999999999994,null,{"$f":"+R124-$S$118","v":75},0.86678417204144764,null,null,51.500000000000036,0.51500000000000035,257.50000000000017,null,null,257.50000000000017,null,null,257.5,397000,397000,397000,null,null,18.5,28.499999999999996,38.5,48.5,58.5,68.5,78.5]
[10,"3",{"$f":"+Scenarioanalyse!D10","v":"Combinatie P/Q (3)"},463636.36363636365,{"$f":"+Scenarioanalyse!G10","v":0},{"$f":"IF(Scenarioanalyse!E10=\"nee\",\"\",IF(E126<>0,E126,D126))","v":463636.36363636365},{"$f":"ROUND(IF(Scenarioanalyse!E10=\"nee\",\"\",+P126),2)","v":425},{"$f":"+Scenarioanalyse!I10","v":0},425,"n.v.t.",515.9,{"$f":"I126*(100/$L$139)","v":85},"",10,0.84999999999999987,424.99999999999994,null,{"$f":"+R125-$S$118","v":50},0.74007330032723806,null,null,52.000000000000036,0.52000000000000035,260.00000000000017,null,null,260.00000000000017,null,null,260,396000,396000,396000,null,null,18,28.000000000000004,38,48,57.999999999999993,68,78,null,null,null,"< gelijkheid P/Q percentage en punten > "]
[9,"4",{"$f":"+Scenarioanalyse!D11","v":"Combinatie P/Q (4)"},445454.54545454547,{"$f":"+Scenarioanalyse!G11","v":0},{"$f":"IF(Scenarioanalyse!E11=\"nee\",\"\",IF(E127<>0,E127,D127))","v":445454.54545454547},{"$f":"ROUND(IF(Scenarioanalyse!E11=\"nee\",\"\",+P127),2)","v":400},{"$f":"+Scenarioanalyse!I11","v":0},400,"n.v.t.",536.4,{"$f":"I127*(100/$L$139)","v":80},"",9,0.79999999999999982,399.99999999999989,null,25.000000000000004,0.62022026576177591,null,null,52.500000000000036,0.52500000000000036,262.50000000000017,null,null,262.50000000000017,null,null,262.5,395000,395000,395000,null,null,17.5,27.500000000000004,37.5,47.5,57.499999999999993,67.5,77.5,null,null,null,"Het wordt aanbevolen om de verdeling van punten voor Prijs en Kwaliteit in dezelfde verhouding te kiezen als de gekozen procentuele P/Q-verhouding."]
[8,"5",{"$f":"+Scenarioanalyse!D12","v":"Combinatie P/Q (5)"},427272.72727272729,{"$f":"+Scenarioanalyse!G12","v":0},{"$f":"IF(Scenarioanalyse!E12=\"nee\",\"\",IF(E128<>0,E128,D128))","v":427272.72727272729},{"$f":"ROUND(IF(Scenarioanalyse!E12=\"nee\",\"\",+P128),2)","v":375},{"$f":"+Scenarioanalyse!I12","v":0},375,"n.v.t.",556.79999999999995,75,"",8,0.74999999999999978,374.99999999999989,null,0,0.50764256786565998,null,null,53.000000000000036,0.53000000000000036,265.00000000000017,null,null,265.00000000000017,null,null,265,394000,394000,394000,null,null,17,27,37,47,56.999999999999993,67,77]
[7,"6",{"$f":"+Scenarioanalyse!D13","v":"Combinatie P/Q (6)"},409090.90909090912,{"$f":"+Scenarioanalyse!G13","v":0},{"$f":"IF(Scenarioanalyse!E13=\"nee\",\"\",IF(E129<>0,E129,D129))","v":409090.90909090912},{"$f":"ROUND(IF(Scenarioanalyse!E13=\"nee\",\"\",+P129),2)","v":350},{"$f":"+Scenarioanalyse!I13","v":0},350,"n.v.t.",577.29999999999995,70,"",7,0.69999999999999973,349.99999999999989,null,-24.999999999999996,0.40284487956872561,null,null,53.500000000000036,0.53500000000000036,267.50000000000017,null,null,267.50000000000017,null,null,267.5,393000,393000,393000,null,null,16.5,26.5,36.5,46.5,56.499999999999993,66.5,76.5,null,null,null,{"$f":"\"Bij \"&AX3&\" punten voor de Qwensen en een P/Q-verhouding van: \"&AX7&\" (P) / \"&AX6&\" (Q), geeft dit een gebroken getal voor het aantal punten voor Prijs: \"&BM11&\" punten.\"","v":"Bij 500 punten voor de Qwensen en een P/Q-verhouding van: 50% (P) / 50% (Q), geeft dit een gebroken getal voor het aantal punten voor Prijs: 500,00 punten."}]
[6,"7",{"$f":"+Scenarioanalyse!D14","v":"Combinatie P/Q (7)"},390909.09090909094,{"$f":"+Scenarioanalyse!G14","v":0},{"$f":"IF(Scenarioanalyse!E14=\"nee\",\"\",IF(E130<>0,E130,D130))","v":390909.09090909094},{"$f":"ROUND(IF(Scenarioanalyse!E14=\"nee\",\"\",+P130),2)","v":325},{"$f":"+Scenarioanalyse!I14","v":0},325,"n.v.t.",597.70000000000005,65,"",6,0.64999999999999969,324.99999999999983,null,-49.999999999999993,0.30645448293783761,null,null,54.000000000000036,0.54000000000000037,270.00000000000017,null,null,270.00000000000017,null,null,270,392000,392000,392000,null,null,16,26,36,46,56.000000000000007,66,76]
[5,"8",{"$f":"+Scenarioanalyse!D15","v":"Combinatie P/Q (8)"},372727.27272727276,{"$f":"+Scenarioanalyse!G15","v":0},{"$f":"IF(Scenarioanalyse!E15=\"nee\",\"\",IF(E131<>0,E131,D131))","v":372727.27272727276},{"$f":"ROUND(IF(Scenarioanalyse!E15=\"nee\",\"\",+P131),2)","v":300},{"$f":"+Scenarioanalyse!I15","v":0},300,"n.v.t.",618.20000000000005,60,"",5,0.59999999999999964,299.99999999999983,null,-74.999999999999986,0.21928097787473758,null,null,54.500000000000036,0.54500000000000037,272.50000000000017,null,null,272.50000000000017,null,null,272.5,391000,391000,391000,null,null,15.5,25.5,35.5,45.5,55.500000000000007,65.5,75.5,null,null,null,{"$f":"\"Dit kan eenvoudig worden door het totaal punten aantal van de wensen bij stap 1 aan te passen naar bijvoorbeeld: \"&AW6*1000&\" punten. \"","v":"Dit kan eenvoudig worden door het totaal punten aantal van de wensen bij stap 1 aan te passen naar bijvoorbeeld: 500 punten. "}]
[4,"9",{"$f":"+Scenarioanalyse!D16","v":"Combinatie P/Q (9)"},354545.45454545459,{"$f":"+Scenarioanalyse!G16","v":0},{"$f":"IF(Scenarioanalyse!E16=\"nee\",\"\",IF(E132<>0,E132,D132))","v":354545.45454545459},{"$f":"ROUND(IF(Scenarioanalyse!E16=\"nee\",\"\",+P132),2)","v":275},{"$f":"+Scenarioanalyse!I16","v":0},275,"n.v.t.",638.6,55,"",4,0.5499999999999996,274.99999999999977,null,-99.999999999999986,0.14242717305466213,null,null,55.000000000000036,0.55000000000000038,275.00000000000017,null,null,275.00000000000017,null,null,275,390000,390000,390000,null,null,15,25,35,45,55.000000000000007,65,75]
[3,"10",{"$f":"+Scenarioanalyse!D17","v":"Combinatie P/Q (10)"},336363.63636363641,{"$f":"+Scenarioanalyse!G17","v":0},{"$f":"IF(Scenarioanalyse!E17=\"nee\",\"\",IF(E133<>0,E133,D133))","v":336363.63636363641},{"$f":"ROUND(IF(Scenarioanalyse!E17=\"nee\",\"\",+P133),2)","v":250},{"$f":"+Scenarioanalyse!I17","v":0},250,"n.v.t.",659.1,50,"",3,0.49999999999999961,249.9999999999998,null,-124.99999999999999,7.75275332202221E-2,null,null,55.500000000000036,0.55500000000000038,277.50000000000017,null,null,277.50000000000017,null,null,277.5,389000,389000,389000,null,null,14.499999999999998,24.5,34.5,44.5,54.500000000000007,64.5,74.5,null,null,null,"Het aanpassen van de P/Q-verhouding is uiteraard ook een mogelijke oplossing."]
[2,"11",{"$f":"+Scenarioanalyse!D18","v":"Combinatie P/Q (11)"},318181.81818181823,{"$f":"+Scenarioanalyse!G18","v":0},{"$f":"IF(Scenarioanalyse!E18=\"nee\",\"\",IF(E134<>0,E134,D134))","v":318181.81818181823},{"$f":"ROUND(IF(Scenarioanalyse!E18=\"nee\",\"\",+P134),2)","v":225},{"$f":"+Scenarioanalyse!I18","v":0},225,"n.v.t.",679.5,45,"",2,0.44999999999999962,224.9999999999998,null,-149.99999999999997,2.7410122234342561E-2,null,null,56.000000000000036,0.56000000000000039,280.00000000000017,null,null,280.00000000000017,null,null,280,388000,388000,388000,null,null,14.000000000000002,24,34,44,54,64,74]
[1,"12",{"$f":"+Scenarioanalyse!D19","v":"Combinatie P/Q (12)"},300000.00000000006,{"$f":"+Scenarioanalyse!G19","v":0},{"$f":"IF(Scenarioanalyse!E19=\"nee\",\"\",IF(E135<>0,E135,D135))","v":300000.00000000006},{"$f":"ROUND(IF(Scenarioanalyse!E19=\"nee\",\"\",+P135),2)","v":200},{"$f":"+Scenarioanalyse!I19","v":0},200,"n.v.t.",700,40,"",1,0.39999999999999963,199.99999999999983,null,-174.99999999999997,0,null,null,56.500000000000043,0.56500000000000039,282.50000000000017,null,null,282.50000000000017,null,null,282.5,387000,387000,387000,null,null,13.5,23.5,33.5,43.5,53.5,63.5,73.5,null,null,null," "]
[null," ","Referentie",{"$f":"IF(ISBLANK(Scenarioanalyse!D20),\"\",Scenarioanalyse!F20)","v":400000},null,{"$f":"IF(E136<>0,E136,D136)","v":400000},{"$f":"ROUND(IF(Scenarioanalyse!E20=\"nee\",\"\",+P136),2)","v":0},null,0,"n.v.t.",{"$f":"+H10","v":500},{"$f":"IF(J136=\"n.v.t.\",I136/$C$6*$F$13,J136)","v":0},null,null,null,null,null,null,null,null,null,57.000000000000043,0.5700000000000004,285.00000000000017,null,null,285.00000000000017,null,null,285,386000,386000,386000,null,null,13,23,33,43,53,63,73,null,null,null,"< Toelichting bij LAQ >"]
[null,null,null,null,null,null,null,null,null,"Aantal",{"$f":"IF(COUNT(K124:K135)=0,\"geen\",COUNT(K124:K135))","v":12},null,null,null,null,null,null,null,null,null,null,57.500000000000043,0.5750000000000004,287.50000000000023,null,null,287.50000000000023,null,null,287.5,385000,385000,385000,null,null,12.5,22.5,32.5,42.5,52.5,62.5,72.5]
[null,null,null,null,null,null,null,null,null,null,"Min",{"$f":"Scenarioanalyse!H22","v":200},null,null,null,null,null,null,null,null,null,58.000000000000043,0.5800000000000004,290.00000000000023,null,null,290.00000000000023,null,null,290,384000,384000,384000,null,null,12,22,32,42,52,62,72,null,null,null,"Met het hanteren van een Lowest Acceptable Quality (LAQ) wordt vastgelegd dat een inschrijving op de kwaliteitswensen (Qwensen) een vooraf bepaalde minimumscore moet behalen. Inschrijvingen die deze ondergrens niet halen, worden uitgesloten van verdere beoordeling. Let op: het toepassen van een LAQ vereist een duidelijke en transparante toelichting in het begeleidende aanbestedingsdocument. "]
[null,null,"Winnaar","Scenario analyse",null,null,null,null,null,null,"Max",{"$f":"C6","v":500},null,null,null,null,null,null,null,null,null,58.500000000000043,0.58500000000000041,292.50000000000023,null,null,292.50000000000023,null,null,292.5,383000,383000,383000,null,null,11.5,21.5,31.5,41.5,51.5,61.5,71.5,null,null,null,"Binnen deze tool is de Lowest Acceptable Quality (LAQ) begrensd op 40% van het totaal aantal punten van de kwaliteitswensen (Qwensen)."]
[null,null,{"$f":"IF(ISERROR(VLOOKUP(1,$A$124:$B$135,2,FALSE)),\"geen\",VLOOKUP(1,$A$124:$B$135,2,FALSE))","v":"12"},null,null,null,null,null,null,null,"Min",{"$f":"+Dashboard!H15","v":300000},null,null,null,null,null,null,null,null,null,59.000000000000043,0.59000000000000041,295.00000000000023,null,null,295.00000000000023,null,null,295,382000,382000,382000,null,null,11,21,31,41,51,61,71,null,null,null,"Het toepassen van de LAQ vereist zorgvuldigheid en bewustzijn van de mogelijke nadelige gevolgen. Raadpleeg hiervoor ook de relevante passages in de handleiding waarin dit nader wordt toegelicht."]
[null,null,null,null,null,null,null,null,null,null,"Max",{"$f":"+Dashboard!H14","v":500000},{"$f":"(L141-L140)/11","v":18181.81818181818},null,null,null,null,null,null,null,null,59.500000000000043,0.59500000000000042,297.50000000000023,null,null,297.50000000000023,null,null,297.5,381000,381000,381000,null,null,10.5,20.5,30.5,40.5,50.5,60.5,70.5]
[null,null,null,null,null,null,null,null,null,null,"Macht",2,null,null,null,null,null,null,null,null,null,60.000000000000043,0.60000000000000042,300.00000000000023,null,null,300.00000000000023,null,null,300,380000,380000,380000,null,null,10,20,30,40,50,60,70]
[null,null,null,null,null,null,null,null,null,null,null,null,null,null,null,null,null,null,null,null,null,60.500000000000043,0.60500000000000043,302.50000000000023,null,null,302.50000000000023,null,null,302.5,379000,379000,379000,null,null,9.5,19.5,29.5,39.5,49.5,59.5,69.5]
[null,null,null,null,null,null,null,null,null,null,null,null,null,null,null,null,null,null,null,null,null,61.000000000000043,0.61000000000000043,305.00000000000023,null,null,305.00000000000023,null,null,305,378000,378000,378000,null,null,9,19,28.999999999999996,39,49,59,69]
[null,null,null,null,null,null,null,null,null,null,null,null,null,null,null,null,null,null,null,null,null,61.500000000000043,0.61500000000000044,307.50000000000023,null,null,307.50000000000023,null,null,307.5,377000,377000,377000,null,null,8.5,18.5,28.499999999999996,38.5,48.5,58.5,68.5]
[null,null,null,null,null,null,null,null,null,null,null,null,null,null,null,null,null,null,null,null,null,62.000000000000043,0.62000000000000044,310.00000000000023,null,null,310.00000000000023,null,null,310,376000,376000,376000,null,null,8,18,28.000000000000004,38,48,57.999999999999993,68]
[null,null,null,null,null,null,null,null,null,null,null,null,null,null,null,null,null,null,null,null,null,62.500000000000043,0.62500000000000044,312.50000000000023,null,null,312.50000000000023,null,null,312.5,375000,375000,375000,null,null,7.5,17.5,27.500000000000004,37.5,47.5,57.499999999999993,67.5]
[null,null,null,null,null,null,null,null,null,null,null,null,null,null,null,null,null,null,null,null,null,63.000000000000043,0.63000000000000045,315.00000000000023,null,null,315.00000000000023,null,null,315,374000,374000,374000,null,null,7.0000000000000009,17,27,37,47,56.999999999999993,67]
[null,"Scenarioanalyse","Keuze","Wortelformule","Machtsformule",null,null,null,null,null,null,null,null,null,null,null,null,null,null,null,null,63.500000000000043,0.63500000000000045,317.50000000000023,null,null,317.50000000000023,null,null,317.5,373000,373000,373000,null,null,6.5,16.5,26.5,36.5,46.5,56.499999999999993,66.5]
[null,null,{"$f":"IF($E$6=\"Wortelformule\",D150,E150)","v":475},{"$f":"I124+$H$6*((($C$17-F124)/($C$17-$C$14))^(1/$H$7))","v":475},{"$f":"ROUND(I124+$H$6-$H$6*(((F124-$C$14)/($C$17-$C$14))^$H$7),1)","v":475},null,null,null,null,null,null,null,null,null,null,null,null,null,null,null,null,{"$f":"$V$223*W150","v":64.000000000000043},0.64000000000000046,320.00000000000023,null,null,320.00000000000023,null,null,320,372000,372000,372000,null,null,6,16,26,36,46,56.000000000000007,66]
[null,null,{"$f":"IF($E$6=\"Wortelformule\",D151,E151)","v":495.5},495.45454545454544,495.5,null,null,null,null,null,null,null,null,null,null,null,null,null,null,null,null,64.500000000000043,0.64500000000000046,{"$f":"+W151*($X$223-$F$14)+$X$22","v":322.50000000000023},null,null,322.50000000000023,null,null,322.5,{"$f":"IF($E$6=\"Wortelformule\",AF151,AG151)","v":371000},{"$f":"$C$17-(AD151^$H$7)*($C$17-$C$14)/($H$6^$H$7)","v":371000},{"$f":"$C$14+($C$17-$C$14)*(($H$6-AD151)/$H$6)^(1/$H$7)","v":371000},null,null,{"$f":"(($AJ$19-AD151)/$H$5)*100","v":5.5},{"$f":"(($AK$19-AD151)/$H$5)*100","v":15.5},{"$f":"(($AL$19-AD151)/$H$5)*100","v":25.5},{"$f":"(($AM$19-AD151)/$H$5)*100","v":35.5},{"$f":"(($AN$19-AD151)/$H$5)*100","v":45.5},{"$f":"(($AO$19-AD151)/$H$5)*100","v":55.500000000000007},{"$f":"(($AP$19-AD151)/$H$5)*100","v":65.5}]
[null,null,{"$f":"IF($E$6=\"Wortelformule\", D152,E152)","v":515.9},515.90909090909088,515.9,null,null,null,null,null,null,null,null,null,null,null,null,null,null,null,null,65.000000000000043,{"$f":"+W151+0.005","v":0.65000000000000047},325.00000000000023,null,null,{"$f":"+X152","v":325.00000000000023},null,null,{"$f":"+AD151+($H$6/200)","v":325},370000,370000,370000,null,null,5,15,25,35,45,55.000000000000007,65]
[null,null,536.4,536.36363636363626,536.4,null,null,null,null,null,null,null,null,null,null,null,null,null,null,null,null,65.500000000000043,0.65500000000000047,327.50000000000023,null,null,327.50000000000023,null,null,327.5,369000,369000,369000,null,null,4.5,14.499999999999998,24.5,34.5,44.5,54.500000000000007,64.5]
[null,null,556.79999999999995,556.81818181818176,556.79999999999995,null,null,null,null,null,null,null,null,null,null,null,null,null,null,null,null,66.000000000000043,0.66000000000000048,330.00000000000023,null,null,330.00000000000023,null,null,330,368000,368000,368000,null,null,4,14.000000000000002,24,34,44,54,64]
[null,null,577.29999999999995,577.27272727272725,577.29999999999995,null,null,null,null,null,null,null,null,null,null,null,null,null,null,null,null,66.500000000000043,0.66500000000000048,332.50000000000023,null,null,332.50000000000023,null,null,332.5,367000,367000,367000,null,null,3.5000000000000004,13.5,23.5,33.5,43.5,53.5,63.5]
[null,null,597.70000000000005,597.72727272727263,597.70000000000005,null,null,null,null,null,null,null,null,null,null,null,null,null,null,null,null,67.000000000000043,0.67000000000000048,335.00000000000023,null,null,335.00000000000023,null,null,335,366000,366000,366000,null,null,3,13,23,33,43,53,63]
[null,null,618.20000000000005,618.18181818181802,618.20000000000005,null,null,null,null,null,null,null,null,null,null,null,null,null,null,null,null,67.500000000000043,0.67500000000000049,337.50000000000023,null,null,337.50000000000023,null,null,337.5,365000,365000,365000,null,null,2.5,12.5,22.5,32.5,42.5,52.5,62.5]
[null,null,638.6,638.63636363636351,638.6,null,null,null,null,null,null,null,null,null,null,null,null,null,null,null,null,68.000000000000043,0.68000000000000049,340.00000000000023,null,null,340.00000000000023,null,null,340,364000,364000,364000,null,null,2,12,22,32,42,52,62]
[null,null,659.1,659.09090909090901,659.1,null,null,null,null,null,null,null,null,null,null,null,null,null,null,null,null,68.500000000000057,0.6850000000000005,342.50000000000023,null,null,342.50000000000023,null,null,342.5,363000,363000,363000,null,null,1.5,11.5,21.5,31.5,41.5,51.5,61.5]
[null,null,{"$f":"IF($E$6=\"Wortelformule\", D160,E160)","v":679.5},{"$f":"I134+$H$6*((($C$17-F134)/($C$17-$C$14))^(1/$H$7))","v":679.5454545454545},{"$f":"ROUND(I134+$H$6-$H$6*(((F134-$C$14)/($C$17-$C$14))^$H$7),1)","v":679.5},null,null,null,null,null,null,null,null,null,null,null,null,null,null,null,null,69.000000000000057,0.6900000000000005,345.00000000000023,null,null,345.00000000000023,null,null,345,362000,362000,362000,null,null,1,11,21,31,41,51,61]
[null,null,700,699.99999999999977,700,null,null,null,null,null,null,null,null,null,null,null,null,null,null,null,null,69.500000000000057,0.69500000000000051,347.50000000000023,null,null,347.50000000000023,null,null,347.5,361000,361000,361000,null,null,0.5,10.5,20.5,30.5,40.5,50.5,60.5]
[null,"Voorbeeld",null,null,null,null,null,null,null,null,null,null,null,null,null,null,null,null,null,null,null,70.000000000000057,0.70000000000000051,350.00000000000023,null,null,350.00000000000023,null,null,350,360000,360000,360000,null,null,0,10,20,30,40,50,60]
[null,"Totaal score",500,{"$f":"ROUND($M$15+$H$6*((($C$17-$C$8)/($C$17-$C$14))^(1/$H$7)),2)","v":500},{"$f":"ROUND($C$12+($H$6-$H$6*((($M$14-$C$14)/($C$17-$C$14))^$H$7)),1)","v":500},null,null,null,null,null,null,null,null,null,null,null,null,null,null,null,null,70.500000000000057,0.70500000000000052,352.50000000000028,null,null,352.50000000000028,null,null,352.5,359000,359000,359000,null,null,-0.5,9.5,19.5,29.5,39.5,49.5,59.5]
[null,"score voor prijs",250,{"$f":"ROUND($H$6*((($C$17-$C$8)/($C$17-$C$14))^(1/$H$7)),2)","v":250},{"$f":"ROUND(($H$6-$H$6*((($M$14-$C$14)/($C$17-$C$14))^$H$7)),1)","v":250},null,null,null,null,null,null,null,null,null,null,null,null,null,null,null,null,71.000000000000057,0.71000000000000052,355.00000000000028,null,null,355.00000000000028,null,null,355,358000,358000,358000,null,null,-1,9,19,28.999999999999996,39,49,59]
[null,"score voor kwaliteit",250,{"$f":"D163-D164","v":250},{"$f":"E163-E164","v":250},null,null,null,null,null,null,null,null,null,null,null,null,null,null,null,null,71.500000000000057,0.71500000000000052,357.50000000000028,null,null,357.50000000000028,null,null,357.5,357000,357000,357000,null,null,-1.5,8.5,18.5,28.499999999999996,38.5,48.5,58.5]
[]
[null,"t.b.v. BD","Keuze","Wortelformule","Machtsformule",null,null,null,null,null,null,null,null,null,null,null,null,null,null,null,null,{"$f":"$V$223*W167","v":72.000000000000057},{"$f":"+W165+0.005","v":0.72000000000000053},{"$f":"+W167*($X$223-$F$14)+$X$22","v":360.00000000000028},null,null,360.00000000000028,null,null,{"$f":"+AD165+($H$6/200)","v":360},356000,356000,356000,null,null,-2,8,18,28.000000000000004,38,48,57.999999999999993]
[null,null,{"$f":"IF($E$6=\"Wortelformule\", D168,E168)","v":625.5},{"$f":"D41+$H$6*((($C$17-C41)/($C$17-$C$14))^(1/$H$7))","v":625.5},{"$f":"ROUND(D41+$H$6-$H$6*(((C41-$C$14)/($C$17-$C$14))^$H$7),1)","v":625.5},null,null,null,null,null,null,null,null,null,null,null,null,null,null,null,null,72.500000000000057,0.72500000000000053,362.50000000000028,null,null,362.50000000000028,null,null,362.5,355000,355000,355000,null,null,-2.5,7.5,17.5,27.500000000000004,37.5,47.5,57.499999999999993]
[null,null,{"$f":"IF($E$6=\"Wortelformule\", D169,E169)","v":713},{"$f":"D42+$H$6*((($C$17-C42)/($C$17-$C$14))^(1/$H$7))","v":713},{"$f":"ROUND(D42+$H$6-$H$6*(((C42-$C$14)/($C$17-$C$14))^$H$7),1)","v":713},null,null,null,null,null,null,null,null,null,null,null,null,null,null,null,null,73.000000000000057,0.73000000000000054,365.00000000000028,null,null,365.00000000000028,null,null,365,354000,354000,354000,null,null,-3,7.0000000000000009,17,27,37,47,56.999999999999993]
[null,null,{"$f":"IF($E$6=\"Wortelformule\", D170,E170)","v":687.5},{"$f":"D43+$H$6*((($C$17-C43)/($C$17-$C$14))^(1/$H$7))","v":687.5},{"$f":"ROUND(D43+$H$6-$H$6*(((C43-$C$14)/($C$17-$C$14))^$H$7),1)","v":687.5},null,null,null,null,null,null,null,null,null,null,null,null,null,null,null,null,73.500000000000057,0.73500000000000054,367.50000000000028,null,null,367.50000000000028,null,null,367.5,353000,353000,353000,null,null,-3.5000000000000004,6.5,16.5,26.5,36.5,46.5,56.499999999999993]
[null,null,{"$f":"IF($E$6=\"Wortelformule\", D171,E171)","v":727.5},{"$f":"D44+$H$6*((($C$17-C44)/($C$17-$C$14))^(1/$H$7))","v":727.5},{"$f":"ROUND(D44+$H$6-$H$6*(((C44-$C$14)/($C$17-$C$14))^$H$7),1)","v":727.5},null,null,null,null,null,null,null,null,null,null,null,null,null,null,null,null,74.000000000000057,0.74000000000000055,370.00000000000028,null,null,370.00000000000028,null,null,370,352000,352000,352000,null,null,-4,6,16,26,36,46,56.000000000000007]
[null,null,{"$f":"IF($E$6=\"Wortelformule\", D172,E172)","v":638},{"$f":"D45+$H$6*((($C$17-C45)/($C$17-$C$14))^(1/$H$7))","v":638},{"$f":"ROUND(D45+$H$6-$H$6*(((C45-$C$14)/($C$17-$C$14))^$H$7),1)","v":638},null,null,null,null,null,null,null,null,null,null,null,null,null,null,null,null,74.500000000000057,0.74500000000000055,372.50000000000028,null,null,372.50000000000028,null,null,372.5,351000,351000,351000,null,null,-4.5,5.5,15.5,25.5,35.5,45.5,55.500000000000007]
[null,null,null,null,null,null,null,null,null,null,null,null,null,null,null,null,null,null,null,null,null,75.000000000000057,0.75000000000000056,375.00000000000028,null,null,375.00000000000028,null,null,375,350000,350000,350000,null,null,-5,5,15,25,35,45,55.000000000000007]
[null,"Evaluatie","Keuze","Wortelformule","Machtsformule",null,null,null,null,null,null,null,null,null,null,null,null,null,null,null,null,75.500000000000057,0.75500000000000056,377.50000000000028,null,null,377.50000000000028,null,null,377.5,349000,349000,349000,null,null,-5.5,4.5,14.499999999999998,24.5,34.5,44.5,54.500000000000007]
[null,null,{"$f":"IF($E$6=\"Wortelformule\", D175,E175)","v":1250},{"$f":"E87+$H$6*((($C$17-D87)/($C$17-$C$14))^(1/$H$7))","v":1250},{"$f":"ROUND(E87+($H$6-$H$6*(((D87-$C$14)/($C$17-$C$14))^$H$7)),1)","v":1250},null,null,null,null,null,null,null,null,null,null,null,null,null,null,null,null,76.000000000000057,0.76000000000000056,380.00000000000028,null,null,380.00000000000028,null,null,380,348000,348000,348000,null,null,-6,4,14.000000000000002,24,34,44,54]
[null,null,1250,1250,{"$f":"ROUND(E88+$H$6-$H$6*(((D88-$C$14)/($C$17-$C$14))^$H$7),1)","v":1250},null,null,null,null,null,null,null,null,null,null,null,null,null,null,null,null,76.500000000000057,0.76500000000000057,382.50000000000028,null,null,382.50000000000028,null,null,382.5,347000,347000,347000,null,null,-6.5,3.5000000000000004,13.5,23.5,33.5,43.5,53.5]
[null,null,1250,1250,1250,null,null,null,null,null,null,null,null,null,null,null,null,null,null,null,null,77.000000000000057,0.77000000000000057,385.00000000000028,null,null,385.00000000000028,null,null,385,346000,346000,346000,null,null,-7.0000000000000009,3,13,23,33,43,53]
[null,null,1250,1250,1250,null,null,null,null,null,null,null,null,null,null,null,null,null,null,null,null,77.500000000000057,0.77500000000000058,387.50000000000028,null,null,387.50000000000028,null,null,387.5,345000,345000,345000,null,null,-7.5,2.5,12.5,22.5,32.5,42.5,52.5]
[null,null,1250,1250,1250,null,null,null,null,null,null,null,null,null,null,null,null,null,null,null,null,78.000000000000057,0.78000000000000058,390.00000000000028,null,null,390.00000000000028,null,null,390,344000,344000,344000,null,null,-8,2,12,22,32,42,52]
[null,null,1250,1250,1250,null,null,null,null,null,null,null,null,null,null,null,null,null,null,null,null,78.500000000000057,0.78500000000000059,392.50000000000028,null,null,392.50000000000028,null,null,392.5,343000,343000,343000,null,null,-8.5,1.5,11.5,21.5,31.5,41.5,51.5]
[null,null,1250,1250,1250,null,null,null,null,null,null,null,null,null,null,null,null,null,null,null,null,79.000000000000057,0.79000000000000059,395.00000000000028,null,null,395.00000000000028,null,null,395,342000,342000,342000,null,null,-9,1,11,21,31,41,51]
[null,null,1250,1250,1250,null,null,null,null,null,null,null,null,null,null,null,null,null,null,null,null,79.500000000000057,0.7950000000000006,397.50000000000028,null,null,397.50000000000028,null,null,397.5,341000,341000,341000,null,null,-9.5,0.5,10.5,20.5,30.5,40.5,50.5]
[null,null,1250,1250,1250,null,null,null,null,null,null,null,null,null,null,null,null,null,null,null,null,{"$f":"$V$223*W183","v":80.000000000000057},0.8000000000000006,400.00000000000028,null,null,400.00000000000028,null,null,400,340000,340000,340000,null,null,-10,0,10,20,30,40,50]
[null,null,1250,1250,1250,null,null,null,null,null,null,null,null,null,null,null,null,null,null,null,null,80.500000000000057,0.8050000000000006,402.50000000000028,null,null,402.50000000000028,null,null,402.5,339000,339000,339000,null,null,-10.5,-0.5,9.5,19.5,29.5,39.5,49.5]
[null,null,1250,1250,1250,null,null,null,null,null,null,null,null,null,null,null,null,null,null,null,null,81.000000000000057,0.81000000000000061,405.00000000000028,null,null,405.00000000000028,null,null,405,338000,338000,338000,null,null,-11,-1,9,19,28.999999999999996,39,49]
[null,null,1250,1250,1250,null,null,null,null,null,null,null,null,null,null,null,null,null,null,null,null,81.500000000000057,0.81500000000000061,407.50000000000028,null,null,407.50000000000028,null,null,407.5,337000,337000,337000,null,null,-11.5,-1.5,8.5,18.5,28.499999999999996,38.5,48.5]
[null,null,null,null,null,null,null,null,null,null,null,null,null,null,null,null,null,null,null,null,null,82.000000000000057,0.82000000000000062,410.00000000000028,null,null,410.00000000000028,null,null,410,336000,336000,336000,null,null,-12,-2,8,18,28.000000000000004,38,48]
[null,null,null,null,null,null,null,null,null,null,null,null,null,null,null,null,null,null,null,null,null,82.500000000000057,0.82500000000000062,412.50000000000028,null,null,412.50000000000028,null,null,412.5,335000,335000,335000,null,null,-12.5,-2.5,7.5,17.5,27.500000000000004,37.5,47.5]
[null,null,null,null,null,null,null,null,null,null,null,null,null,null,null,null,null,null,null,null,null,83.000000000000057,0.83000000000000063,415.00000000000034,null,null,415.00000000000034,null,null,415,334000,334000,334000,null,null,-13,-3,7.0000000000000009,17,27,37,47]
[null,null,null,null,null,null,null,null,null,null,null,null,null,null,null,null,null,null,null,null,null,83.500000000000057,0.83500000000000063,417.50000000000034,null,null,417.50000000000034,null,null,417.5,333000,333000,333000,null,null,-13.5,-3.5000000000000004,6.5,16.5,26.5,36.5,46.5]
[null,"Scoregraph voor Prijs",null,null,null,null,null,null,null,null,null,null,null,null,null,null,null,null,null,null,null,84.000000000000057,0.84000000000000064,420.00000000000034,null,null,420.00000000000034,null,null,420,332000,332000,332000,null,null,-14.000000000000002,-4,6,16,26,36,46]
[null,null,null,null,null,null,null,null,null,null,null,null,null,null,null,null,null,null,null,null,null,84.500000000000057,0.84500000000000064,422.50000000000034,null,null,422.50000000000034,null,null,422.5,331000,331000,331000,null,null,-14.499999999999998,-4.5,5.5,15.5,25.5,35.5,45.5]
[null,"Hulpvelden voor as-indeling Scoregraph prijs",null,null,"Voorbeeld Inschrijving",{"$f":"Dashboard!H18","v":400000},null,null,null,null,null,null,null,null,null,null,null,null,null,null,null,85.000000000000071,0.85000000000000064,425.00000000000034,null,null,425.00000000000034,null,null,425,330000,330000,330000,null,null,-15,-5,5,15,25,35,45]
[null,null,"X-as","Y-as",null,{"$f":"$H$6*((($C$196-F193)/($C$17-$C$14))^(1/$H$7))","v":250},null,null,null,null,null,null,null,null,null,null,null,null,null,null,null,85.500000000000071,{"$f":"+W193+0.005","v":0.85500000000000065},427.50000000000034,null,null,427.50000000000034,null,null,427.5,329000,329000,329000,null,null,-15.5,-5.5,4.5,14.499999999999998,24.5,34.5,44.5]
[null,"ondergrens",{"$f":"+Dashboard!$H$15","v":300000},0,null,null,null,null,null,null,null,null,null,null,null,null,null,null,null,null,null,86.000000000000071,0.86000000000000065,430.00000000000034,null,null,430.00000000000034,null,null,430,328000,328000,328000,null,null,-16,-6,4,14.000000000000002,24,34,44]
[null,"bovengrens",{"$f":"Dashboard!$H$14","v":500000},{"$f":"Dashboard!$H$11","v":500},null,null,null,null,null,null,null,null,null,null,null,null,null,null,null,null,null,86.500000000000071,0.86500000000000066,432.50000000000034,null,null,432.50000000000034,null,null,432.5,327000,327000,327000,null,null,-16.5,-6.5,3.5000000000000004,13.5,23.5,33.5,43.5]
[null,"primaire eenheid",{"$f":"(C17-C14)/5","v":40000},{"$f":"D196/10","v":50},null,null,null,null,null,null,null,null,null,null,null,null,null,null,null,null,null,87.000000000000071,0.87000000000000066,435.00000000000034,null,null,435.00000000000034,null,null,435,326000,326000,326000,null,null,-17,-7.0000000000000009,3,13,23,33,43]
[null,"Stappen x-as",{"$f":"(C17-C14)/100","v":2000},null,null,null,null,null,null,null,null,null,null,null,null,null,null,null,null,null,null,87.500000000000071,0.87500000000000067,437.50000000000034,null,null,437.50000000000034,null,null,437.5,325000,325000,325000,null,null,-17.5,-7.5,2.5,12.5,22.5,32.5,42.5]
[null,null,null,null,"Keuze","wortel","macht",null,null,null,null,null,null,null,null,null,null,null,null,null,null,88.000000000000071,{"$f":"+W198+0.005","v":0.88000000000000067},{"$f":"+W199*($X$223-$F$14)+$X$22","v":440.00000000000034},null,null,440.00000000000034,null,null,440,324000,324000,324000,null,null,-18,-8,2,12,22,32,42]
[null,"Stappen","y-as","x-as"," ","Psi","Psi",null,null,null,null,null,null,null,null,null,null,null,null,null,null,88.500000000000071,0.88500000000000068,442.50000000000034,null,null,442.50000000000034,null,null,442.5,323000,323000,323000,null,null,-18.5,-8.5,1.5,11.5,21.5,31.5,41.5]
[null,0,{"$f":"D195","v":0},{"$f":"C14","v":300000},{"$f":"IF($E$6=\"Wortelformule\",F201,G201)","v":500},{"$f":"$H$6*((($C$196-D201)/($C$17-$C$14))^(1/$H$7))","v":500},{"$f":"$H$6-$H$6*(((D201-$C$14)/($C$17-$C$14))^$H$7)","v":500},null,null,null,null,null,null,null,null,null,null,null,null,null,null,89.000000000000071,0.89000000000000068,445.00000000000034,null,null,445.00000000000034,null,null,445,322000,322000,322000,null,null,-19,-9,1,11,21,31,41]
[null,{"$f":"+B201+1","v":1},{"$f":"+C201+$D$197","v":50},{"$f":"+D201+$C$198","v":302000},{"$f":"IF($E$6=\"Wortelformule\",F202,G202)","v":495},495,{"$f":"$H$6-$H$6*(((D202-$C$14)/($C$17-$C$14))^$H$7)","v":495},null,null,null,null,null,null,null,null,null,null,null,null,null,null,89.500000000000071,0.89500000000000068,447.50000000000034,null,null,447.50000000000034,null,null,447.5,321000,321000,321000,null,null,-19.5,-9.5,0.5,10.5,20.5,30.5,40.5]
[null,{"$f":"+B202+1","v":2},100,{"$f":"+D202+$C$198","v":304000},490,490,490,null,null,null,null,null,null,null,null,null,null,null,null,null,null,90.000000000000071,0.90000000000000069,450.00000000000034,null,null,450.00000000000034,null,null,450,320000,320000,320000,null,null,-20,-10,0,10,20,30,40]
[null,3,150,306000,485,485,485,null,null,null,null,null,null,null,null,null,null,null,null,null,null,90.500000000000071,0.90500000000000069,452.50000000000034,null,null,452.50000000000034,null,null,452.5,319000,319000,319000,null,null,-20.5,-10.5,-0.5,9.5,19.5,29.5,39.5]
[null,4,200,308000,480,480,480,null,null,null,null,null,null,null,null,null,null,null,null,null,null,91.000000000000071,0.9100000000000007,455.00000000000034,null,null,455.00000000000034,null,null,455,318000,318000,318000,null,null,-21,-11,-1,9,19,28.999999999999996,39]
[null,5,250,310000,475,475,475,null,null,null,null,null,null,null,null,null,null,null,null,null,null,91.500000000000071,0.9150000000000007,457.50000000000034,null,null,457.50000000000034,null,null,457.5,317000,317000,317000,null,null,-21.5,-11.5,-1.5,8.5,18.5,28.499999999999996,38.5]
[null,6,300,312000,470,470,470,null,null,null,null,null,null,null,null,null,null,null,null,null,null,92.000000000000071,0.92000000000000071,460.00000000000034,null,null,460.00000000000034,null,null,460,316000,316000,316000,null,null,-22,-12,-2,8,18,28.000000000000004,38]
[null,7,350,314000,465,465,465,null,null,null,null,null,null,null,null,null,null,null,null,null,null,92.500000000000071,0.92500000000000071,462.50000000000034,null,null,462.50000000000034,null,null,462.5,315000,315000,315000,null,null,-22.5,-12.5,-2.5,7.5,17.5,27.500000000000004,37.5]
[null,8,400,316000,460,460,460,null,null,null,null,null,null,null,null,null,null,null,null,null,null,93.000000000000071,0.93000000000000071,465.00000000000034,null,null,465.00000000000034,null,null,465,314000,314000,314000,null,null,-23,-13,-3,7.0000000000000009,17,27,37]
[null,9,450,318000,455,455,455,null,null,null,null,null,null,null,null,null,null,null,null,null,null,93.500000000000071,0.93500000000000072,467.50000000000034,null,null,467.50000000000034,null,null,467.5,313000,313000,313000,null,null,-23.5,-13.5,-3.5000000000000004,6.5,16.5,26.5,36.5]
[null,10,500,320000,450,450,450,null,null,null,null,null,null,null,null,null,null,null,null,null,null,94.000000000000071,0.94000000000000072,470.00000000000034,null,null,470.00000000000034,null,null,470,312000,312000,312000,null,null,-24,-14.000000000000002,-4,6,16,26,36]
[null,11,550,322000,445,445,445,null,null,null,null,null,null,null,null,null,null,null,null,null,null,94.500000000000071,0.94500000000000073,472.50000000000034,null,null,472.50000000000034,null,null,472.5,311000,311000,311000,null,null,-24.5,-14.499999999999998,-4.5,5.5,15.5,25.5,35.5]
[null,12,600,324000,440,440,440,null,null,null,null,null,null,null,null,null,null,null,null,null,null,95.000000000000071,0.95000000000000073,475.00000000000034,null,null,475.00000000000034,null,null,475,310000,310000,310000,null,null,-25,-15,-5,5,15,25,35]
[null,13,650,326000,435,435,435,null,null,null,null,null,null,null,null,null,null,null,null,null,null,95.500000000000071,0.95500000000000074,477.50000000000034,null,null,477.50000000000034,null,null,477.5,309000,309000,309000,null,null,-25.5,-15.5,-5.5,4.5,14.499999999999998,24.5,34.5]
[null,14,700,328000,430,430,430,null,null,null,null,null,null,null,null,null,null,null,null,null,null,{"$f":"$V$223*W215","v":96.000000000000071},0.96000000000000074,480.0000000000004,null,null,480.0000000000004,null,null,480,308000,308000,308000,null,null,-26,-16,-6,4,14.000000000000002,24,34]
[null,15,750,330000,425,425,425,null,null,null,null,null,null,null,null,null,null,null,null,null,null,96.500000000000071,0.96500000000000075,482.5000000000004,null,null,482.5000000000004,null,null,482.5,{"$f":"IF($E$6=\"Wortelformule\",AF216,AG216)","v":307000},{"$f":"$C$17-(AD216^$H$7)*($C$17-$C$14)/($H$6^$H$7)","v":307000},{"$f":"$C$14+($C$17-$C$14)*(($H$6-AD216)/$H$6)^(1/$H$7)","v":307000},null,null,{"$f":"(($AJ$19-AD216)/$H$5)*100","v":-26.5},{"$f":"(($AK$19-AD216)/$H$5)*100","v":-16.5},{"$f":"(($AL$19-AD216)/$H$5)*100","v":-6.5},{"$f":"(($AM$19-AD216)/$H$5)*100","v":3.5000000000000004},{"$f":"(($AN$19-AD216)/$H$5)*100","v":13.5},{"$f":"(($AO$19-AD216)/$H$5)*100","v":23.5},{"$f":"(($AP$19-AD216)/$H$5)*100","v":33.5}]
[null,16,800,332000,420,420,420,null,null,null,null,null,null,null,null,null,null,null,null,null,null,97.000000000000071,{"$f":"+W216+0.005","v":0.97000000000000075},485.0000000000004,null,null,{"$f":"+X217","v":485.0000000000004},null,null,{"$f":"+AD216+($H$6/200)","v":485},306000,306000,306000,null,null,-27,-17,-7.0000000000000009,3,13,23,33]
[null,17,850,334000,415,415,415,null,null,null,null,null,null,null,null,null,null,null,null,null,null,97.500000000000071,0.97500000000000075,487.5000000000004,null,null,487.5000000000004,null,null,487.5,305000,305000,305000,null,null,-27.500000000000004,-17.5,-7.5,2.5,12.5,22.5,32.5]
[null,18,900,336000,410,410,410,null,null,null,null,null,null,null,null,null,null,null,null,null,null,98.000000000000071,0.98000000000000076,490.0000000000004,null,null,490.0000000000004,null,null,490,304000,304000,304000,null,null,-28.000000000000004,-18,-8,2,12,22,32]
[null,19,950,338000,405,405,405,null,null,null,null,null,null,null,null,null,null,null,null,null,null,98.500000000000071,0.98500000000000076,492.5000000000004,null,null,492.5000000000004,null,null,492.5,303000,303000,303000,null,null,-28.499999999999996,-18.5,-8.5,1.5,11.5,21.5,31.5]
[null,20,1000,340000,400,400,400,null,null,null,null,null,null,null,null,null,null,null,null,null,null,99.000000000000071,0.99000000000000077,495.0000000000004,null,null,495.0000000000004,null,null,495,302000,302000,302000,null,null,-28.999999999999996,-19,-9,1,11,21,31]
[null,21,1050,342000,395,395,395,null,null,null,null,null,null,null,null,null,null,null,null,null,null,99.500000000000071,0.99500000000000077,497.5000000000004,null,null,497.5000000000004,null,null,497.5,301000,301000,301000,null,null,-29.5,-19.5,-9.5,0.5,10.5,20.5,30.5]
[null,22,1100,344000,390,390,390,null,null,null,null,null,null,null,null,null,null,null,null,null,null,100,1,{"$f":"C6","v":500},"= Qwensen",null,{"$f":"+X223","v":500},null,null,500,300000,300000,{"$f":"AF223","v":300000},null,null,-30,-20,-10,0,10,20,30]
[null,23,1150,346000,385,385,385,null,null,null,null,null,null,null,null,null,null,null,null,null,null,null,null,null,null,null,null,null,null,"= Psmax"]
[null,24,1200,348000,380,380,380]
[null,25,1250,350000,375,375,375]
[null,26,1300,352000,370,370,370]
[null,27,1350,354000,365,365,365]
[null,28,1400,356000,360,360,360]
[null,29,1450,358000,355,355,355]
[null,30,1500,360000,350,350,350]
[null,31,1550,362000,345,345,345]
[null,32,1600,364000,340,{"$f":"$H$6*((($C$196-D233)/($C$17-$C$14))^(1/$H$7))","v":340},340]
[null,33,{"$f":"+C233+$D$197","v":1650},366000,335,335,335]
[null,34,1700,368000,330,330,330]
[null,35,1750,370000,325,325,325]
[null,36,1800,372000,320,320,320]
[null,37,1850,374000,315,315,315]
[null,38,1900,376000,310,310,310]
[null,39,1950,378000,305,305,305]
[null,40,2000,380000,300,300,300]
[null,41,2050,382000,295,295,295]
[null,42,2100,384000,290,290,290]
[null,43,2150,386000,285,285,285]
[null,44,2200,388000,280,280,280]
[null,45,2250,390000,275,275,275]
[null,46,2300,392000,270,270,270]
[null,47,2350,394000,265,265,265]
[null,48,2400,396000,260,260,260]
[null,49,2450,398000,255,255,255]
[null,50,2500,400000,250,250,250]
[null,51,2550,402000,245,245,245]
[null,52,2600,404000,240,240,240]
[null,53,2650,406000,235,235,235]
[null,54,2700,408000,230,230,230]
[null,55,2750,410000,225,225,225]
[null,56,2800,412000,220,220,220]
[null,57,2850,414000,215,215,215]
[null,58,2900,416000,210,210,210]
[null,59,2950,418000,205,205,205]
[null,60,3000,420000,200,200,200]
[null,61,3050,422000,195,195,195]
[null,62,3100,424000,190,190,190]
[null,63,3150,426000,185,185,185]
[null,64,3200,428000,180,{"$f":"$H$6*((($C$196-D265)/($C$17-$C$14))^(1/$H$7))","v":180},180]
[null,65,{"$f":"+C265+$D$197","v":3250},430000,{"$f":"IF($E$6=\"Wortelformule\",F266,G266)","v":175},175,{"$f":"$H$6-$H$6*(((D266-$C$14)/($C$17-$C$14))^$H$7)","v":175}]
[null,{"$f":"+B266+1","v":66},3300,{"$f":"+D266+$C$198","v":432000},170,170,170]
[null,67,3350,434000,165,165,165]
[null,68,3400,436000,160,160,160]
[null,69,3450,438000,155,155,155]
[null,70,3500,440000,150,150,150]
[null,71,3550,442000,145,145,145]
[null,72,3600,444000,140,140,140]
[null,73,3650,446000,135,135,135]
[null,74,3700,448000,130,130,130]
[null,75,3750,450000,125,125,125]
[null,76,3800,452000,120,120,120]
[null,77,3850,454000,115,115,115]
[null,78,3900,456000,110,110,110]
[null,79,3950,458000,105,105,105]
[null,80,4000,460000,100,100,100]
[null,81,4050,462000,95,95,95]
[null,82,4100,464000,90,90,90]
[null,83,4150,466000,85,85,85]
[null,84,4200,468000,80,80,80]
[null,85,4250,470000,75,75,75]
[null,86,4300,472000,70,70,70]
[null,87,4350,474000,65,65,65]
[null,88,4400,476000,60,60,60]
[null,89,4450,478000,55,55,55]
[null,90,4500,480000,50,50,50]
[null,91,4550,482000,45,45,45]
[null,92,4600,484000,40,40,40]
[null,93,4650,486000,35,35,35]
[null,94,4700,488000,30,30,30]
[null,95,4750,490000,25,25,25]
[null,96,4800,492000,20,20,20]
[null,97,4850,494000,15,15,15]
[null,98,4900,496000,10,10,10]
[null,99,4950,498000,5,5,5]
[null,100,5000,500000,0,0,0]

{"sheet":"BPK-Grafiek","index":8,"n_rows":43,"n_cols":16,"rows_kept":43,"cut":false,"hidden":true,"merged":[]}
[]
[null,"Europese Aanbesteding"]
[null,{"$f":"+DATA!C34","v":" "}]
[null,"BPK-Grafiek"]
[null,{"$f":"\"Kenmerk: \" & DATA!C35","v":"Kenmerk:  "}]
[null,"Bedragen excl. BTW"]
[]
[null,null,null,null,null,null,"Vergelijkingswaarde"]
[]
[null,null,null,null,null,null,"Indicatie eigen score","Score Kwaliteit"]
[null,null,null,null,null,null,"Eigen inschatting score kwaliteit*"]
[null,null,null,null,null,null,{"$f":"\"* Eigen inschatting door Inschrijver. Waarde tussen 0 en \"& DATA!C12 &\" punten.\"","v":"* Eigen inschatting door Inschrijver. Waarde tussen 0 en 500 punten."}]
[null,null,null,null,null,null,"Score voor Prijs",{"$f":"DATA!G2","v":1250}]
[null,null,null,null,null,null,"Indicatie BPK-score",{"$f":"+DATA!I2","v":1250}]
[]
[null,null,null,null,null,null,"Voorbeeld"]
[null,null,null,null,null,null,"Prijs voorbeeld inschrijving",{"$f":"DATA!C25","v":400000}]
[null,null,null,null,null,null,"Prijsscore voorbeeld inschrijving",{"$f":"DATA!C27","v":250}]
[null,null,null,null,null,null,"Kwaliteitscore voorbeeld inschrijving",{"$f":"DATA!C26","v":250}]
[null,null,null,null,null,null,"Voorbeeld BPK-score Pvbi | Qvbi",{"$f":"DATA!C28","v":500}]
[null,null,null,null,null,null,"Knockout op Kwaliteit (Q)                            < ",{"$f":"IF(+DATA!D22<=0,\"n.v.t.\",+DATA!D22)","v":"n.v.t."}]
[]
[]
[]
[]
[]
[]
[]
[]
[]
[]
[]
[]
[]
[]
[]
[]
[]
[]
[]
[]
[]
[null,null,null,null,null,null,null,null,null,null,null,null,null,null,null," "]

{"sheet":"DATA","index":9,"n_rows":208,"n_cols":16,"rows_kept":208,"cut":false,"hidden":true,"merged":[]}
[]
[null,"Uw Inschrijving",{"$f":"'BPK-Grafiek'!H8","v":0},"Qscore",{"$f":"'BPK-Grafiek'!H11","v":0},"Pscore",{"$f":"IF(C5=\"Machtsformule\",ROUND($C$10-$C$10*(((C2-$C$20)/($C$21-$C$20))^$C$23),1),ROUND(C10*((($C$21-C2)/($C$21-$C$20))^(1/$C$23)),1))","v":1250},"BPK-score",{"$f":"E2+G2","v":1250},"Qscore (norm)",{"$f":"E2/C6*100","v":0}]
[]
[null,"De hieronder opgenomen date is noodzakelijk voor de opbouw van de BPK-grafiek"]
[null,"Type formule",{"$f":"'HULP-velden'!E6","v":"Machtsformule"},null,null,null,null,"Y-as",null,"X-as"]
[null,"Qmax (x-as)",{"$f":"+C12","v":500},{"$f":"+C6","v":500},null,null,null,null,null,"BPK-Lijnen"]
[null,"Qmax (y-as)",0,{"$f":"+C25*2","v":800000},null,null,null,"Prijs",null,{"$f":"+'HULP-velden'!AJ16","v":"BPK-Lijn -3"},{"$f":"+'HULP-velden'!AK16","v":"BPK-Lijn -2"},{"$f":"+'HULP-velden'!AL16","v":"BPK-Lijn -1"},{"$f":"+'HULP-velden'!AM16","v":"BPK-lijn Ref"},{"$f":"+'HULP-velden'!AN16","v":"BPK-Lijn +1"},{"$f":"+'HULP-velden'!AO16","v":"BPK-Lijn +2"},{"$f":"+'HULP-velden'!AP16","v":"BPK-Lijn +3"}]
[null,"Plafondprijs (x-as)",0,{"$f":"+C12","v":500},null,null,null,{"$f":"'HULP-velden'!AE22","v":500000},null,{"$f":"+'HULP-velden'!AJ22","v":70},{"$f":"+'HULP-velden'!AK22","v":80},{"$f":"+'HULP-velden'!AL22","v":90},{"$f":"+'HULP-velden'!AM22","v":100},{"$f":"+'HULP-velden'!AN22","v":110.00000000000001},{"$f":"+'HULP-velden'!AO22","v":120},{"$f":"+'HULP-velden'!AP22","v":130}]
[null,"Plafondprijs (y-as)",{"$f":"+C19","v":-100000},{"$f":"+C19","v":-100000},null,null,null,{"$f":"'HULP-velden'!AE23","v":499000},null,{"$f":"+'HULP-velden'!AJ23","v":69.5},{"$f":"+'HULP-velden'!AK23","v":79.5},{"$f":"+'HULP-velden'!AL23","v":89.5},{"$f":"+'HULP-velden'!AM23","v":99.5},{"$f":"+'HULP-velden'!AN23","v":109.5},{"$f":"+'HULP-velden'!AO23","v":119.5},{"$f":"+'HULP-velden'!AP23","v":129.5}]
[null,"Punten voor Prijs",{"$f":"'HULP-velden'!H6","v":500},null,null,null,null,{"$f":"'HULP-velden'!AE24","v":498000},null,{"$f":"+'HULP-velden'!AJ24","v":69},{"$f":"+'HULP-velden'!AK24","v":79},{"$f":"+'HULP-velden'!AL24","v":89},{"$f":"+'HULP-velden'!AM24","v":99},{"$f":"+'HULP-velden'!AN24","v":109.00000000000001},{"$f":"+'HULP-velden'!AO24","v":119},{"$f":"+'HULP-velden'!AP24","v":129}]
[null,"Methode/Qref",{"$f":"'HULP-velden'!M15","v":250},{"$f":"'HULP-velden'!F7","v":0},null,null,null,{"$f":"'HULP-velden'!AE25","v":497000},null,{"$f":"+'HULP-velden'!AJ25","v":68.5},{"$f":"+'HULP-velden'!AK25","v":78.5},{"$f":"+'HULP-velden'!AL25","v":88.5},{"$f":"+'HULP-velden'!AM25","v":98.5},{"$f":"+'HULP-velden'!AN25","v":108.5},{"$f":"+'HULP-velden'!AO25","v":118.5},{"$f":"+'HULP-velden'!AP25","v":128.5}]
[null,"Qwensen",{"$f":"'HULP-velden'!C6","v":500},null,null,null,null,{"$f":"'HULP-velden'!AE26","v":496000},null,{"$f":"+'HULP-velden'!AJ26","v":68},{"$f":"+'HULP-velden'!AK26","v":78},{"$f":"+'HULP-velden'!AL26","v":88},{"$f":"+'HULP-velden'!AM26","v":98},{"$f":"+'HULP-velden'!AN26","v":108},{"$f":"+'HULP-velden'!AO26","v":118},{"$f":"+'HULP-velden'!AP26","v":128}]
[null,"Stappen",{"$f":"+'HULP-velden'!C7","v":25},null,null,null,null,{"$f":"'HULP-velden'!AE27","v":495000},null,{"$f":"+'HULP-velden'!AJ27","v":67.5},{"$f":"+'HULP-velden'!AK27","v":77.5},{"$f":"+'HULP-velden'!AL27","v":87.5},{"$f":"+'HULP-velden'!AM27","v":97.5},{"$f":"+'HULP-velden'!AN27","v":107.5},{"$f":"+'HULP-velden'!AO27","v":117.5},{"$f":"+'HULP-velden'!AP27","v":127.49999999999999}]
[null,null,null,null,null,null,null,{"$f":"'HULP-velden'!AE28","v":494000},null,{"$f":"+'HULP-velden'!AJ28","v":67},{"$f":"+'HULP-velden'!AK28","v":77},{"$f":"+'HULP-velden'!AL28","v":87},{"$f":"+'HULP-velden'!AM28","v":97},{"$f":"+'HULP-velden'!AN28","v":107},{"$f":"+'HULP-velden'!AO28","v":117},{"$f":"+'HULP-velden'!AP28","v":127}]
[null,"Q-score voorbeeld inschrijvig",{"$f":"'HULP-velden'!F12","v":50},null,null,null,null,{"$f":"'HULP-velden'!AE29","v":493000},null,{"$f":"+'HULP-velden'!AJ29","v":66.5},{"$f":"+'HULP-velden'!AK29","v":76.5},{"$f":"+'HULP-velden'!AL29","v":86.5},{"$f":"+'HULP-velden'!AM29","v":96.5},{"$f":"+'HULP-velden'!AN29","v":106.5},{"$f":"+'HULP-velden'!AO29","v":116.5},{"$f":"+'HULP-velden'!AP29","v":126.49999999999999}]
[null,"Wq",{"$f":"+'HULP-velden'!C10","v":0.5},{"$f":"+D6","v":500},null,null,null,{"$f":"'HULP-velden'!AE30","v":492000},null,{"$f":"+'HULP-velden'!AJ30","v":66},{"$f":"+'HULP-velden'!AK30","v":76},{"$f":"+'HULP-velden'!AL30","v":86},{"$f":"+'HULP-velden'!AM30","v":96},{"$f":"+'HULP-velden'!AN30","v":106},{"$f":"+'HULP-velden'!AO30","v":115.99999999999999},{"$f":"+'HULP-velden'!AP30","v":126}]
[null,"Wp",{"$f":"+'HULP-velden'!C11","v":0.5},{"$f":"D16/C16*C17","v":500},null,null,null,{"$f":"'HULP-velden'!AE31","v":491000},null,{"$f":"+'HULP-velden'!AJ31","v":65.5},{"$f":"+'HULP-velden'!AK31","v":75.5},{"$f":"+'HULP-velden'!AL31","v":85.5},{"$f":"+'HULP-velden'!AM31","v":95.5},{"$f":"+'HULP-velden'!AN31","v":105.5},{"$f":"+'HULP-velden'!AO31","v":115.5},{"$f":"+'HULP-velden'!AP31","v":125.49999999999999}]
[null,null,null,null,null,null,null,{"$f":"'HULP-velden'!AE32","v":490000},null,{"$f":"+'HULP-velden'!AJ32","v":65},{"$f":"+'HULP-velden'!AK32","v":75},{"$f":"+'HULP-velden'!AL32","v":85},{"$f":"+'HULP-velden'!AM32","v":95},{"$f":"+'HULP-velden'!AN32","v":105},{"$f":"+'HULP-velden'!AO32","v":114.99999999999999},{"$f":"+'HULP-velden'!AP32","v":125}]
[null,"Plafondprijs",{"$f":"+'HULP-velden'!C13","v":-100000},null,null,null,null,{"$f":"'HULP-velden'!AE33","v":489000},null,{"$f":"+'HULP-velden'!AJ33","v":64.5},{"$f":"+'HULP-velden'!AK33","v":74.5},{"$f":"+'HULP-velden'!AL33","v":84.5},{"$f":"+'HULP-velden'!AM33","v":94.5},{"$f":"+'HULP-velden'!AN33","v":104.5},{"$f":"+'HULP-velden'!AO33","v":114.5},{"$f":"+'HULP-velden'!AP33","v":124.50000000000001}]
[null,"Ondergrens",{"$f":"+'HULP-velden'!C14","v":300000},{"$f":"+C20","v":300000},null,null,null,{"$f":"'HULP-velden'!AE34","v":488000},null,{"$f":"+'HULP-velden'!AJ34","v":64},{"$f":"+'HULP-velden'!AK34","v":74},{"$f":"+'HULP-velden'!AL34","v":84},{"$f":"+'HULP-velden'!AM34","v":94},{"$f":"+'HULP-velden'!AN34","v":104},{"$f":"+'HULP-velden'!AO34","v":113.99999999999999},{"$f":"+'HULP-velden'!AP34","v":124}]
[null,"Bovengrens",{"$f":"+'HULP-velden'!C17","v":500000},{"$f":"+C21","v":500000},null,null,null,{"$f":"'HULP-velden'!AE35","v":487000},null,{"$f":"+'HULP-velden'!AJ35","v":63.5},{"$f":"+'HULP-velden'!AK35","v":73.5},{"$f":"+'HULP-velden'!AL35","v":83.5},{"$f":"+'HULP-velden'!AM35","v":93.5},{"$f":"+'HULP-velden'!AN35","v":103.49999999999999},{"$f":"+'HULP-velden'!AO35","v":113.5},{"$f":"+'HULP-velden'!AP35","v":123.50000000000001}]
[null,"LAQ",{"$f":"+'HULP-velden'!C15","v":-1000},{"$f":"Dashboard!H22","v":0},null,null,null,{"$f":"'HULP-velden'!AE36","v":486000},null,{"$f":"+'HULP-velden'!AJ36","v":63},{"$f":"+'HULP-velden'!AK36","v":73},{"$f":"+'HULP-velden'!AL36","v":83},{"$f":"+'HULP-velden'!AM36","v":93},{"$f":"+'HULP-velden'!AN36","v":103},{"$f":"+'HULP-velden'!AO36","v":112.99999999999999},{"$f":"+'HULP-velden'!AP36","v":123}]
[null,"n-factor",{"$f":"Dashboard!H16","v":1},null,null,null,null,{"$f":"'HULP-velden'!AE37","v":485000},null,{"$f":"+'HULP-velden'!AJ37","v":62.5},{"$f":"+'HULP-velden'!AK37","v":72.5},{"$f":"+'HULP-velden'!AL37","v":82.5},{"$f":"+'HULP-velden'!AM37","v":92.5},{"$f":"+'HULP-velden'!AN37","v":102.49999999999999},{"$f":"+'HULP-velden'!AO37","v":112.5},{"$f":"+'HULP-velden'!AP37","v":122.50000000000001}]
[null,null,null,null,null,null,null,{"$f":"'HULP-velden'!AE38","v":484000},null,{"$f":"+'HULP-velden'!AJ38","v":62},{"$f":"+'HULP-velden'!AK38","v":72},{"$f":"+'HULP-velden'!AL38","v":82},{"$f":"+'HULP-velden'!AM38","v":92},{"$f":"+'HULP-velden'!AN38","v":102},{"$f":"+'HULP-velden'!AO38","v":112.00000000000001},{"$f":"+'HULP-velden'!AP38","v":122}]
[null,"Prijs voorbeeld inschrijving",{"$f":"+'HULP-velden'!C8","v":400000},null,null,null,null,{"$f":"'HULP-velden'!AE39","v":483000},null,{"$f":"+'HULP-velden'!AJ39","v":61.5},{"$f":"+'HULP-velden'!AK39","v":71.5},{"$f":"+'HULP-velden'!AL39","v":81.5},{"$f":"+'HULP-velden'!AM39","v":91.5},{"$f":"+'HULP-velden'!AN39","v":101.49999999999999},{"$f":"+'HULP-velden'!AO39","v":111.5},{"$f":"+'HULP-velden'!AP39","v":121.50000000000001}]
[null,"Score kwaliteit voorbeeld inschrijving",{"$f":"'HULP-velden'!C165","v":250},null,null,null,null,{"$f":"'HULP-velden'!AE40","v":482000},null,{"$f":"+'HULP-velden'!AJ40","v":61},{"$f":"+'HULP-velden'!AK40","v":71},{"$f":"+'HULP-velden'!AL40","v":81},{"$f":"+'HULP-velden'!AM40","v":91},{"$f":"+'HULP-velden'!AN40","v":101},{"$f":"+'HULP-velden'!AO40","v":111.00000000000001},{"$f":"+'HULP-velden'!AP40","v":121}]
[null,"Score prijs voorbeeld inschrijving",{"$f":"'HULP-velden'!C164","v":250},null,null,null,null,{"$f":"'HULP-velden'!AE41","v":481000},null,{"$f":"+'HULP-velden'!AJ41","v":60.5},{"$f":"+'HULP-velden'!AK41","v":70.5},{"$f":"+'HULP-velden'!AL41","v":80.5},{"$f":"+'HULP-velden'!AM41","v":90.5},{"$f":"+'HULP-velden'!AN41","v":100.49999999999999},{"$f":"+'HULP-velden'!AO41","v":110.5},{"$f":"+'HULP-velden'!AP41","v":120.5}]
[null,"BPK-Score voorbeeld",{"$f":"'HULP-velden'!C163","v":500},null,null,null,null,{"$f":"'HULP-velden'!AE42","v":480000},null,{"$f":"+'HULP-velden'!AJ42","v":60},{"$f":"+'HULP-velden'!AK42","v":70},{"$f":"+'HULP-velden'!AL42","v":80},{"$f":"+'HULP-velden'!AM42","v":90},{"$f":"+'HULP-velden'!AN42","v":100},{"$f":"+'HULP-velden'!AO42","v":110.00000000000001},{"$f":"+'HULP-velden'!AP42","v":120}]
[null,null,null,null,null,null,null,{"$f":"'HULP-velden'!AE43","v":479000},null,{"$f":"+'HULP-velden'!AJ43","v":59.5},{"$f":"+'HULP-velden'!AK43","v":69.5},{"$f":"+'HULP-velden'!AL43","v":79.5},{"$f":"+'HULP-velden'!AM43","v":89.5},{"$f":"+'HULP-velden'!AN43","v":99.5},{"$f":"+'HULP-velden'!AO43","v":109.5},{"$f":"+'HULP-velden'!AP43","v":119.5}]
[null,null,null,null,null,null,null,{"$f":"'HULP-velden'!AE44","v":478000},null,{"$f":"+'HULP-velden'!AJ44","v":59},{"$f":"+'HULP-velden'!AK44","v":69},{"$f":"+'HULP-velden'!AL44","v":79},{"$f":"+'HULP-velden'!AM44","v":89},{"$f":"+'HULP-velden'!AN44","v":99},{"$f":"+'HULP-velden'!AO44","v":109.00000000000001},{"$f":"+'HULP-velden'!AP44","v":119}]
[null,null,null,null,null,null,null,{"$f":"'HULP-velden'!AE45","v":477000},null,{"$f":"+'HULP-velden'!AJ45","v":58.5},{"$f":"+'HULP-velden'!AK45","v":68.5},{"$f":"+'HULP-velden'!AL45","v":78.5},{"$f":"+'HULP-velden'!AM45","v":88.5},{"$f":"+'HULP-velden'!AN45","v":98.5},{"$f":"+'HULP-velden'!AO45","v":108.5},{"$f":"+'HULP-velden'!AP45","v":118.5}]
[null,null,null,null,null,null,null,{"$f":"'HULP-velden'!AE46","v":476000},null,{"$f":"+'HULP-velden'!AJ46","v":57.999999999999993},{"$f":"+'HULP-velden'!AK46","v":68},{"$f":"+'HULP-velden'!AL46","v":78},{"$f":"+'HULP-velden'!AM46","v":88},{"$f":"+'HULP-velden'!AN46","v":98},{"$f":"+'HULP-velden'!AO46","v":108},{"$f":"+'HULP-velden'!AP46","v":118}]
[null,null,null,null,null,null,null,{"$f":"'HULP-velden'!AE47","v":475000},null,{"$f":"+'HULP-velden'!AJ47","v":57.499999999999993},{"$f":"+'HULP-velden'!AK47","v":67.5},{"$f":"+'HULP-velden'!AL47","v":77.5},{"$f":"+'HULP-velden'!AM47","v":87.5},{"$f":"+'HULP-velden'!AN47","v":97.5},{"$f":"+'HULP-velden'!AO47","v":107.5},{"$f":"+'HULP-velden'!AP47","v":117.5}]
[null,"Naam",{"$f":"Dashboard!E6","v":" "},null,null,null,null,{"$f":"'HULP-velden'!AE48","v":474000},null,{"$f":"+'HULP-velden'!AJ48","v":56.999999999999993},{"$f":"+'HULP-velden'!AK48","v":67},{"$f":"+'HULP-velden'!AL48","v":77},{"$f":"+'HULP-velden'!AM48","v":87},{"$f":"+'HULP-velden'!AN48","v":97},{"$f":"+'HULP-velden'!AO48","v":107},{"$f":"+'HULP-velden'!AP48","v":117}]
[null,"Kenmerk",{"$f":"Dashboard!E7","v":" "},null,null,null,null,{"$f":"'HULP-velden'!AE49","v":473000},null,{"$f":"+'HULP-velden'!AJ49","v":56.499999999999993},{"$f":"+'HULP-velden'!AK49","v":66.5},{"$f":"+'HULP-velden'!AL49","v":76.5},{"$f":"+'HULP-velden'!AM49","v":86.5},{"$f":"+'HULP-velden'!AN49","v":96.5},{"$f":"+'HULP-velden'!AO49","v":106.5},{"$f":"+'HULP-velden'!AP49","v":116.5}]
[null,null,null,null,null,null,null,{"$f":"'HULP-velden'!AE50","v":472000},null,{"$f":"+'HULP-velden'!AJ50","v":56.000000000000007},{"$f":"+'HULP-velden'!AK50","v":66},{"$f":"+'HULP-velden'!AL50","v":76},{"$f":"+'HULP-velden'!AM50","v":86},{"$f":"+'HULP-velden'!AN50","v":96},{"$f":"+'HULP-velden'!AO50","v":106},{"$f":"+'HULP-velden'!AP50","v":115.99999999999999}]
[null,null,null,null,null,null,null,{"$f":"'HULP-velden'!AE51","v":471000},null,{"$f":"+'HULP-velden'!AJ51","v":55.500000000000007},{"$f":"+'HULP-velden'!AK51","v":65.5},{"$f":"+'HULP-velden'!AL51","v":75.5},{"$f":"+'HULP-velden'!AM51","v":85.5},{"$f":"+'HULP-velden'!AN51","v":95.5},{"$f":"+'HULP-velden'!AO51","v":105.5},{"$f":"+'HULP-velden'!AP51","v":115.5}]
[null,"Ten behoeve van grafiek",null,null,null,null,null,{"$f":"'HULP-velden'!AE52","v":470000},null,{"$f":"+'HULP-velden'!AJ52","v":55.000000000000007},{"$f":"+'HULP-velden'!AK52","v":65},{"$f":"+'HULP-velden'!AL52","v":75},{"$f":"+'HULP-velden'!AM52","v":85},{"$f":"+'HULP-velden'!AN52","v":95},{"$f":"+'HULP-velden'!AO52","v":105},{"$f":"+'HULP-velden'!AP52","v":114.99999999999999}]
[null,"Onder-lijn (x-as)",null,{"$f":"'HULP-velden'!D104","v":280000},null,null,null,{"$f":"'HULP-velden'!AE53","v":469000},null,{"$f":"+'HULP-velden'!AJ53","v":54.500000000000007},{"$f":"+'HULP-velden'!AK53","v":64.5},{"$f":"+'HULP-velden'!AL53","v":74.5},{"$f":"+'HULP-velden'!AM53","v":84.5},{"$f":"+'HULP-velden'!AN53","v":94.5},{"$f":"+'HULP-velden'!AO53","v":104.5},{"$f":"+'HULP-velden'!AP53","v":114.5}]
[null,"Qmax",{"$f":"+'HULP-velden'!C20","v":100},{"$f":"+'HULP-velden'!D20","v":100},null,null,null,{"$f":"'HULP-velden'!AE54","v":468000},null,{"$f":"+'HULP-velden'!AJ54","v":54},{"$f":"+'HULP-velden'!AK54","v":64},{"$f":"+'HULP-velden'!AL54","v":74},{"$f":"+'HULP-velden'!AM54","v":84},{"$f":"+'HULP-velden'!AN54","v":94},{"$f":"+'HULP-velden'!AO54","v":104},{"$f":"+'HULP-velden'!AP54","v":113.99999999999999}]
[null,"Bovenlijn",{"$f":"+'HULP-velden'!C21","v":0},{"$f":"+'HULP-velden'!D21","v":520000},null,null,null,{"$f":"'HULP-velden'!AE55","v":467000},null,{"$f":"+'HULP-velden'!AJ55","v":53.5},{"$f":"+'HULP-velden'!AK55","v":63.5},{"$f":"+'HULP-velden'!AL55","v":73.5},{"$f":"+'HULP-velden'!AM55","v":83.5},{"$f":"+'HULP-velden'!AN55","v":93.5},{"$f":"+'HULP-velden'!AO55","v":103.49999999999999},{"$f":"+'HULP-velden'!AP55","v":113.5}]
[null,"Referentie",{"$f":"'HULP-velden'!M15","v":250},{"$f":"+'HULP-velden'!M14","v":400000},null,null,null,{"$f":"'HULP-velden'!AE56","v":466000},null,{"$f":"+'HULP-velden'!AJ56","v":53},{"$f":"+'HULP-velden'!AK56","v":63},{"$f":"+'HULP-velden'!AL56","v":73},{"$f":"+'HULP-velden'!AM56","v":83},{"$f":"+'HULP-velden'!AN56","v":93},{"$f":"+'HULP-velden'!AO56","v":103},{"$f":"+'HULP-velden'!AP56","v":112.99999999999999}]
[null,"Qknockout Prijs",{"$f":"'HULP-velden'!C23","v":0},{"$f":"'HULP-velden'!D23","v":100},null,null,null,{"$f":"'HULP-velden'!AE57","v":465000},null,{"$f":"+'HULP-velden'!AJ57","v":52.5},{"$f":"+'HULP-velden'!AK57","v":62.5},{"$f":"+'HULP-velden'!AL57","v":72.5},{"$f":"+'HULP-velden'!AM57","v":82.5},{"$f":"+'HULP-velden'!AN57","v":92.5},{"$f":"+'HULP-velden'!AO57","v":102.49999999999999},{"$f":"+'HULP-velden'!AP57","v":112.5}]
[null,null,{"$f":"+'HULP-velden'!C13","v":-100000},{"$f":"+C44","v":-100000},null,null,null,{"$f":"'HULP-velden'!AE58","v":464000},null,{"$f":"+'HULP-velden'!AJ58","v":52},{"$f":"+'HULP-velden'!AK58","v":62},{"$f":"+'HULP-velden'!AL58","v":72},{"$f":"+'HULP-velden'!AM58","v":82},{"$f":"+'HULP-velden'!AN58","v":92},{"$f":"+'HULP-velden'!AO58","v":102},{"$f":"+'HULP-velden'!AP58","v":112.00000000000001}]
[null,"Vergelijkingswaarde x 1.000",0,{"$f":"+'HULP-velden'!D21","v":520000},null,null,null,{"$f":"'HULP-velden'!AE59","v":463000},null,{"$f":"+'HULP-velden'!AJ59","v":51.5},{"$f":"+'HULP-velden'!AK59","v":61.5},{"$f":"+'HULP-velden'!AL59","v":71.5},{"$f":"+'HULP-velden'!AM59","v":81.5},{"$f":"+'HULP-velden'!AN59","v":91.5},{"$f":"+'HULP-velden'!AO59","v":101.49999999999999},{"$f":"+'HULP-velden'!AP59","v":111.5}]
[null,"Qkncokout Kwaliteit",{"$f":"'HULP-velden'!C26","v":-1000},{"$f":"'HULP-velden'!D26","v":-1000},null,null,null,{"$f":"'HULP-velden'!AE60","v":462000},null,{"$f":"+'HULP-velden'!AJ60","v":51},{"$f":"+'HULP-velden'!AK60","v":61},{"$f":"+'HULP-velden'!AL60","v":71},{"$f":"+'HULP-velden'!AM60","v":81},{"$f":"+'HULP-velden'!AN60","v":91},{"$f":"+'HULP-velden'!AO60","v":101},{"$f":"+'HULP-velden'!AP60","v":111.00000000000001}]
[null,"Qmin",{"$f":"'HULP-velden'!C28","v":0},{"$f":"'HULP-velden'!D28","v":0},null,null,null,{"$f":"'HULP-velden'!AE61","v":461000},null,{"$f":"+'HULP-velden'!AJ61","v":50.5},{"$f":"+'HULP-velden'!AK61","v":60.5},{"$f":"+'HULP-velden'!AL61","v":70.5},{"$f":"+'HULP-velden'!AM61","v":80.5},{"$f":"+'HULP-velden'!AN61","v":90.5},{"$f":"+'HULP-velden'!AO61","v":100.49999999999999},{"$f":"+'HULP-velden'!AP61","v":110.5}]
[null,"Punten bij Qmin",{"$f":"+C47","v":0},0,null,null,null,{"$f":"'HULP-velden'!AE62","v":460000},null,{"$f":"+'HULP-velden'!AJ62","v":50},{"$f":"+'HULP-velden'!AK62","v":60},{"$f":"+'HULP-velden'!AL62","v":70},{"$f":"+'HULP-velden'!AM62","v":80},{"$f":"+'HULP-velden'!AN62","v":90},{"$f":"+'HULP-velden'!AO62","v":100},{"$f":"+'HULP-velden'!AP62","v":110.00000000000001}]
[null,"Punten Bij Qmax",{"$f":"C12","v":500},0,null,null,null,{"$f":"'HULP-velden'!AE63","v":459000},null,{"$f":"+'HULP-velden'!AJ63","v":49.5},{"$f":"+'HULP-velden'!AK63","v":59.5},{"$f":"+'HULP-velden'!AL63","v":69.5},{"$f":"+'HULP-velden'!AM63","v":79.5},{"$f":"+'HULP-velden'!AN63","v":89.5},{"$f":"+'HULP-velden'!AO63","v":99.5},{"$f":"+'HULP-velden'!AP63","v":109.5}]
[null,"Waarde bij Qmin",{"$f":"'HULP-velden'!C29","v":0},null,null,null,null,{"$f":"'HULP-velden'!AE64","v":458000},null,{"$f":"+'HULP-velden'!AJ64","v":49},{"$f":"+'HULP-velden'!AK64","v":59},{"$f":"+'HULP-velden'!AL64","v":69},{"$f":"+'HULP-velden'!AM64","v":79},{"$f":"+'HULP-velden'!AN64","v":89},{"$f":"+'HULP-velden'!AO64","v":99},{"$f":"+'HULP-velden'!AP64","v":109.00000000000001}]
[null,"Waarde bij Qmax",{"$f":"'HULP-velden'!C30","v":500},null,null,null,null,{"$f":"'HULP-velden'!AE65","v":457000},null,{"$f":"+'HULP-velden'!AJ65","v":48.5},{"$f":"+'HULP-velden'!AK65","v":58.5},{"$f":"+'HULP-velden'!AL65","v":68.5},{"$f":"+'HULP-velden'!AM65","v":78.5},{"$f":"+'HULP-velden'!AN65","v":88.5},{"$f":"+'HULP-velden'!AO65","v":98.5},{"$f":"+'HULP-velden'!AP65","v":108.5}]
[null,"LAQ",{"$f":"'HULP-velden'!C26","v":-1000},{"$f":"'HULP-velden'!D26","v":-1000},null,null,null,{"$f":"'HULP-velden'!AE66","v":456000},null,{"$f":"+'HULP-velden'!AJ66","v":48},{"$f":"+'HULP-velden'!AK66","v":57.999999999999993},{"$f":"+'HULP-velden'!AL66","v":68},{"$f":"+'HULP-velden'!AM66","v":78},{"$f":"+'HULP-velden'!AN66","v":88},{"$f":"+'HULP-velden'!AO66","v":98},{"$f":"+'HULP-velden'!AP66","v":108}]
[null,"Tekst",{"$f":"'HULP-velden'!G15","v":"LAQ = "},null,null,null,null,{"$f":"'HULP-velden'!AE67","v":455000},null,{"$f":"+'HULP-velden'!AJ67","v":47.5},{"$f":"+'HULP-velden'!AK67","v":57.499999999999993},{"$f":"+'HULP-velden'!AL67","v":67.5},{"$f":"+'HULP-velden'!AM67","v":77.5},{"$f":"+'HULP-velden'!AN67","v":87.5},{"$f":"+'HULP-velden'!AO67","v":97.5},{"$f":"+'HULP-velden'!AP67","v":107.5}]
[null,"Plafondprijs",{"$f":"'HULP-velden'!C13","v":-100000},{"$f":"+C54","v":-100000},null,null,null,{"$f":"'HULP-velden'!AE68","v":454000},null,{"$f":"+'HULP-velden'!AJ68","v":47},{"$f":"+'HULP-velden'!AK68","v":56.999999999999993},{"$f":"+'HULP-velden'!AL68","v":67},{"$f":"+'HULP-velden'!AM68","v":77},{"$f":"+'HULP-velden'!AN68","v":87},{"$f":"+'HULP-velden'!AO68","v":97},{"$f":"+'HULP-velden'!AP68","v":107}]
[null,"Tekst",{"$f":"'HULP-velden'!G16","v":"Plafondprijs; -€ 100"},null,null,null,null,{"$f":"'HULP-velden'!AE69","v":453000},null,{"$f":"+'HULP-velden'!AJ69","v":46.5},{"$f":"+'HULP-velden'!AK69","v":56.499999999999993},{"$f":"+'HULP-velden'!AL69","v":66.5},{"$f":"+'HULP-velden'!AM69","v":76.5},{"$f":"+'HULP-velden'!AN69","v":86.5},{"$f":"+'HULP-velden'!AO69","v":96.5},{"$f":"+'HULP-velden'!AP69","v":106.5}]
[null,null,null,null,null,null,null,{"$f":"'HULP-velden'!AE70","v":452000},null,{"$f":"+'HULP-velden'!AJ70","v":46},{"$f":"+'HULP-velden'!AK70","v":56.000000000000007},{"$f":"+'HULP-velden'!AL70","v":66},{"$f":"+'HULP-velden'!AM70","v":76},{"$f":"+'HULP-velden'!AN70","v":86},{"$f":"+'HULP-velden'!AO70","v":96},{"$f":"+'HULP-velden'!AP70","v":106}]
[null,null,null,null,null,null,null,{"$f":"'HULP-velden'!AE71","v":451000},null,{"$f":"+'HULP-velden'!AJ71","v":45.5},{"$f":"+'HULP-velden'!AK71","v":55.500000000000007},{"$f":"+'HULP-velden'!AL71","v":65.5},{"$f":"+'HULP-velden'!AM71","v":75.5},{"$f":"+'HULP-velden'!AN71","v":85.5},{"$f":"+'HULP-velden'!AO71","v":95.5},{"$f":"+'HULP-velden'!AP71","v":105.5}]
[null,null,null,null,null,null,null,{"$f":"'HULP-velden'!AE72","v":450000},null,{"$f":"+'HULP-velden'!AJ72","v":45},{"$f":"+'HULP-velden'!AK72","v":55.000000000000007},{"$f":"+'HULP-velden'!AL72","v":65},{"$f":"+'HULP-velden'!AM72","v":75},{"$f":"+'HULP-velden'!AN72","v":85},{"$f":"+'HULP-velden'!AO72","v":95},{"$f":"+'HULP-velden'!AP72","v":105}]
[null,"Ten behoeve van de grafiek Evaluatie",null,null,null,null,null,{"$f":"'HULP-velden'!AE73","v":449000},null,{"$f":"+'HULP-velden'!AJ73","v":44.5},{"$f":"+'HULP-velden'!AK73","v":54.500000000000007},{"$f":"+'HULP-velden'!AL73","v":64.5},{"$f":"+'HULP-velden'!AM73","v":74.5},{"$f":"+'HULP-velden'!AN73","v":84.5},{"$f":"+'HULP-velden'!AO73","v":94.5},{"$f":"+'HULP-velden'!AP73","v":104.5}]
[null,null,"Vergelijkingswaarde","Q-score","in %","Score","Rang",{"$f":"'HULP-velden'!AE74","v":448000},null,{"$f":"+'HULP-velden'!AJ74","v":44},{"$f":"+'HULP-velden'!AK74","v":54},{"$f":"+'HULP-velden'!AL74","v":64},{"$f":"+'HULP-velden'!AM74","v":74},{"$f":"+'HULP-velden'!AN74","v":84},{"$f":"+'HULP-velden'!AO74","v":94},{"$f":"+'HULP-velden'!AP74","v":104}]
[null,{"$f":"'HULP-velden'!D51","v":""},{"$f":"'HULP-velden'!E51","v":""},{"$f":"'HULP-velden'!F51","v":""},{"$f":"IF(D61=\"\",\"\",D61/$C$12*100)","v":""},{"$f":"IF(D61=\"\",\"\",'HULP-velden'!H51)","v":""},{"$f":"IF(D61=\"\",\"\",'HULP-velden'!K51)","v":""},{"$f":"'HULP-velden'!AE75","v":447000},null,{"$f":"+'HULP-velden'!AJ75","v":43.5},{"$f":"+'HULP-velden'!AK75","v":53.5},{"$f":"+'HULP-velden'!AL75","v":63.5},{"$f":"+'HULP-velden'!AM75","v":73.5},{"$f":"+'HULP-velden'!AN75","v":83.5},{"$f":"+'HULP-velden'!AO75","v":93.5},{"$f":"+'HULP-velden'!AP75","v":103.49999999999999}]
[null,{"$f":"'HULP-velden'!D52","v":""},{"$f":"'HULP-velden'!E52","v":""},{"$f":"'HULP-velden'!F52","v":""},{"$f":"IF(D62=\"\",\"\",D62/$C$12*100)","v":""},{"$f":"IF(D62=\"\",\"\",'HULP-velden'!H52)","v":""},{"$f":"IF(D62=\"\",\"\",'HULP-velden'!K52)","v":""},{"$f":"'HULP-velden'!AE76","v":446000},null,{"$f":"+'HULP-velden'!AJ76","v":43},{"$f":"+'HULP-velden'!AK76","v":53},{"$f":"+'HULP-velden'!AL76","v":63},{"$f":"+'HULP-velden'!AM76","v":73},{"$f":"+'HULP-velden'!AN76","v":83},{"$f":"+'HULP-velden'!AO76","v":93},{"$f":"+'HULP-velden'!AP76","v":103}]
[null,{"$f":"'HULP-velden'!D53","v":""},{"$f":"'HULP-velden'!E53","v":""},{"$f":"'HULP-velden'!F53","v":""},{"$f":"IF(D63=\"\",\"\",D63/$C$12*100)","v":""},{"$f":"IF(D63=\"\",\"\",'HULP-velden'!H53)","v":""},{"$f":"IF(D63=\"\",\"\",'HULP-velden'!K53)","v":""},{"$f":"'HULP-velden'!AE77","v":445000},null,{"$f":"+'HULP-velden'!AJ77","v":42.5},{"$f":"+'HULP-velden'!AK77","v":52.5},{"$f":"+'HULP-velden'!AL77","v":62.5},{"$f":"+'HULP-velden'!AM77","v":72.5},{"$f":"+'HULP-velden'!AN77","v":82.5},{"$f":"+'HULP-velden'!AO77","v":92.5},{"$f":"+'HULP-velden'!AP77","v":102.49999999999999}]
[null,{"$f":"'HULP-velden'!D54","v":""},{"$f":"'HULP-velden'!E54","v":""},{"$f":"'HULP-velden'!F54","v":""},"",{"$f":"IF(D64=\"\",\"\",'HULP-velden'!H54)","v":""},{"$f":"IF(D64=\"\",\"\",'HULP-velden'!K54)","v":""},{"$f":"'HULP-velden'!AE78","v":444000},null,{"$f":"+'HULP-velden'!AJ78","v":42},{"$f":"+'HULP-velden'!AK78","v":52},{"$f":"+'HULP-velden'!AL78","v":62},{"$f":"+'HULP-velden'!AM78","v":72},{"$f":"+'HULP-velden'!AN78","v":82},{"$f":"+'HULP-velden'!AO78","v":92},{"$f":"+'HULP-velden'!AP78","v":102}]
[null,{"$f":"'HULP-velden'!D55","v":""},{"$f":"'HULP-velden'!E55","v":""},{"$f":"'HULP-velden'!F55","v":""},"",{"$f":"IF(D65=\"\",\"\",'HULP-velden'!H55)","v":""},{"$f":"IF(D65=\"\",\"\",'HULP-velden'!K55)","v":""},{"$f":"'HULP-velden'!AE79","v":443000},null,{"$f":"+'HULP-velden'!AJ79","v":41.5},{"$f":"+'HULP-velden'!AK79","v":51.5},{"$f":"+'HULP-velden'!AL79","v":61.5},{"$f":"+'HULP-velden'!AM79","v":71.5},{"$f":"+'HULP-velden'!AN79","v":81.5},{"$f":"+'HULP-velden'!AO79","v":91.5},{"$f":"+'HULP-velden'!AP79","v":101.49999999999999}]
[null,{"$f":"'HULP-velden'!D56","v":""},{"$f":"'HULP-velden'!E56","v":""},{"$f":"'HULP-velden'!F56","v":""},"",{"$f":"IF(D66=\"\",\"\",'HULP-velden'!H56)","v":""},{"$f":"IF(D66=\"\",\"\",'HULP-velden'!K56)","v":""},{"$f":"'HULP-velden'!AE80","v":442000},null,{"$f":"+'HULP-velden'!AJ80","v":41},{"$f":"+'HULP-velden'!AK80","v":51},{"$f":"+'HULP-velden'!AL80","v":61},{"$f":"+'HULP-velden'!AM80","v":71},{"$f":"+'HULP-velden'!AN80","v":81},{"$f":"+'HULP-velden'!AO80","v":91},{"$f":"+'HULP-velden'!AP80","v":101}]
[null,{"$f":"'HULP-velden'!D57","v":""},{"$f":"'HULP-velden'!E57","v":""},{"$f":"'HULP-velden'!F57","v":""},"",{"$f":"IF(D67=\"\",\"\",'HULP-velden'!H57)","v":""},{"$f":"IF(D67=\"\",\"\",'HULP-velden'!K57)","v":""},{"$f":"'HULP-velden'!AE81","v":441000},null,{"$f":"+'HULP-velden'!AJ81","v":40.5},{"$f":"+'HULP-velden'!AK81","v":50.5},{"$f":"+'HULP-velden'!AL81","v":60.5},{"$f":"+'HULP-velden'!AM81","v":70.5},{"$f":"+'HULP-velden'!AN81","v":80.5},{"$f":"+'HULP-velden'!AO81","v":90.5},{"$f":"+'HULP-velden'!AP81","v":100.49999999999999}]
[null,{"$f":"'HULP-velden'!D58","v":""},{"$f":"'HULP-velden'!E58","v":""},{"$f":"'HULP-velden'!F58","v":""},"",{"$f":"IF(D68=\"\",\"\",'HULP-velden'!H58)","v":""},{"$f":"IF(D68=\"\",\"\",'HULP-velden'!K58)","v":""},{"$f":"'HULP-velden'!AE82","v":440000},null,{"$f":"+'HULP-velden'!AJ82","v":40},{"$f":"+'HULP-velden'!AK82","v":50},{"$f":"+'HULP-velden'!AL82","v":60},{"$f":"+'HULP-velden'!AM82","v":70},{"$f":"+'HULP-velden'!AN82","v":80},{"$f":"+'HULP-velden'!AO82","v":90},{"$f":"+'HULP-velden'!AP82","v":100}]
[null,{"$f":"'HULP-velden'!D59","v":""},{"$f":"'HULP-velden'!E59","v":""},{"$f":"'HULP-velden'!F59","v":""},"",{"$f":"IF(D69=\"\",\"\",'HULP-velden'!H59)","v":""},{"$f":"IF(D69=\"\",\"\",'HULP-velden'!K59)","v":""},{"$f":"'HULP-velden'!AE83","v":439000},null,{"$f":"+'HULP-velden'!AJ83","v":39.5},{"$f":"+'HULP-velden'!AK83","v":49.5},{"$f":"+'HULP-velden'!AL83","v":59.5},{"$f":"+'HULP-velden'!AM83","v":69.5},{"$f":"+'HULP-velden'!AN83","v":79.5},{"$f":"+'HULP-velden'!AO83","v":89.5},{"$f":"+'HULP-velden'!AP83","v":99.5}]
[null,{"$f":"'HULP-velden'!D60","v":""},{"$f":"'HULP-velden'!E60","v":""},{"$f":"'HULP-velden'!F60","v":""},"",{"$f":"IF(D70=\"\",\"\",'HULP-velden'!H60)","v":""},{"$f":"IF(D70=\"\",\"\",'HULP-velden'!K60)","v":""},{"$f":"'HULP-velden'!AE84","v":438000},null,{"$f":"+'HULP-velden'!AJ84","v":39},{"$f":"+'HULP-velden'!AK84","v":49},{"$f":"+'HULP-velden'!AL84","v":59},{"$f":"+'HULP-velden'!AM84","v":69},{"$f":"+'HULP-velden'!AN84","v":79},{"$f":"+'HULP-velden'!AO84","v":89},{"$f":"+'HULP-velden'!AP84","v":99}]
[null,{"$f":"'HULP-velden'!D61","v":""},{"$f":"'HULP-velden'!E61","v":""},{"$f":"'HULP-velden'!F61","v":""},"",{"$f":"IF(D71=\"\",\"\",'HULP-velden'!H61)","v":""},{"$f":"IF(D71=\"\",\"\",'HULP-velden'!K61)","v":""},{"$f":"'HULP-velden'!AE85","v":437000},null,{"$f":"+'HULP-velden'!AJ85","v":38.5},{"$f":"+'HULP-velden'!AK85","v":48.5},{"$f":"+'HULP-velden'!AL85","v":58.5},{"$f":"+'HULP-velden'!AM85","v":68.5},{"$f":"+'HULP-velden'!AN85","v":78.5},{"$f":"+'HULP-velden'!AO85","v":88.5},{"$f":"+'HULP-velden'!AP85","v":98.5}]
[null,{"$f":"'HULP-velden'!D62","v":""},{"$f":"'HULP-velden'!E62","v":""},{"$f":"'HULP-velden'!F62","v":""},"",{"$f":"IF(D72=\"\",\"\",'HULP-velden'!H62)","v":""},{"$f":"IF(D72=\"\",\"\",'HULP-velden'!K62)","v":""},{"$f":"'HULP-velden'!AE86","v":436000},null,{"$f":"+'HULP-velden'!AJ86","v":38},{"$f":"+'HULP-velden'!AK86","v":48},{"$f":"+'HULP-velden'!AL86","v":57.999999999999993},{"$f":"+'HULP-velden'!AM86","v":68},{"$f":"+'HULP-velden'!AN86","v":78},{"$f":"+'HULP-velden'!AO86","v":88},{"$f":"+'HULP-velden'!AP86","v":98}]
[null,{"$f":"'HULP-velden'!D63","v":"Referentie"},{"$f":"'HULP-velden'!E63","v":400000},{"$f":"'HULP-velden'!F63","v":250},50,{"$f":"IF(D73=\"\",\"\",'HULP-velden'!H63)","v":500},null,{"$f":"'HULP-velden'!AE87","v":435000},null,{"$f":"+'HULP-velden'!AJ87","v":37.5},{"$f":"+'HULP-velden'!AK87","v":47.5},{"$f":"+'HULP-velden'!AL87","v":57.499999999999993},{"$f":"+'HULP-velden'!AM87","v":67.5},{"$f":"+'HULP-velden'!AN87","v":77.5},{"$f":"+'HULP-velden'!AO87","v":87.5},{"$f":"+'HULP-velden'!AP87","v":97.5}]
[null,null,null,null,null,null,null,{"$f":"'HULP-velden'!AE88","v":434000},null,{"$f":"+'HULP-velden'!AJ88","v":37},{"$f":"+'HULP-velden'!AK88","v":47},{"$f":"+'HULP-velden'!AL88","v":56.999999999999993},{"$f":"+'HULP-velden'!AM88","v":67},{"$f":"+'HULP-velden'!AN88","v":77},{"$f":"+'HULP-velden'!AO88","v":87},{"$f":"+'HULP-velden'!AP88","v":97}]
[null,null,null,null,null,null,null,{"$f":"'HULP-velden'!AE89","v":433000},null,{"$f":"+'HULP-velden'!AJ89","v":36.5},{"$f":"+'HULP-velden'!AK89","v":46.5},{"$f":"+'HULP-velden'!AL89","v":56.499999999999993},{"$f":"+'HULP-velden'!AM89","v":66.5},{"$f":"+'HULP-velden'!AN89","v":76.5},{"$f":"+'HULP-velden'!AO89","v":86.5},{"$f":"+'HULP-velden'!AP89","v":96.5}]
[null,null,null,null,null,null,null,{"$f":"'HULP-velden'!AE90","v":432000},null,{"$f":"+'HULP-velden'!AJ90","v":36},{"$f":"+'HULP-velden'!AK90","v":46},{"$f":"+'HULP-velden'!AL90","v":56.000000000000007},{"$f":"+'HULP-velden'!AM90","v":66},{"$f":"+'HULP-velden'!AN90","v":76},{"$f":"+'HULP-velden'!AO90","v":86},{"$f":"+'HULP-velden'!AP90","v":96}]
[null,null,null,null,null,null,null,{"$f":"'HULP-velden'!AE91","v":431000},null,{"$f":"+'HULP-velden'!AJ91","v":35.5},{"$f":"+'HULP-velden'!AK91","v":45.5},{"$f":"+'HULP-velden'!AL91","v":55.500000000000007},{"$f":"+'HULP-velden'!AM91","v":65.5},{"$f":"+'HULP-velden'!AN91","v":75.5},{"$f":"+'HULP-velden'!AO91","v":85.5},{"$f":"+'HULP-velden'!AP91","v":95.5}]
[null,null,null,null,null,null,null,{"$f":"'HULP-velden'!AE92","v":430000},null,{"$f":"+'HULP-velden'!AJ92","v":35},{"$f":"+'HULP-velden'!AK92","v":45},{"$f":"+'HULP-velden'!AL92","v":55.000000000000007},{"$f":"+'HULP-velden'!AM92","v":65},{"$f":"+'HULP-velden'!AN92","v":75},{"$f":"+'HULP-velden'!AO92","v":85},{"$f":"+'HULP-velden'!AP92","v":95}]
[null,null,null,null,null,null,null,{"$f":"'HULP-velden'!AE93","v":429000},null,{"$f":"+'HULP-velden'!AJ93","v":34.5},{"$f":"+'HULP-velden'!AK93","v":44.5},{"$f":"+'HULP-velden'!AL93","v":54.500000000000007},{"$f":"+'HULP-velden'!AM93","v":64.5},{"$f":"+'HULP-velden'!AN93","v":74.5},{"$f":"+'HULP-velden'!AO93","v":84.5},{"$f":"+'HULP-velden'!AP93","v":94.5}]
[null,null,null,null,null,null,null,{"$f":"'HULP-velden'!AE94","v":428000},null,{"$f":"+'HULP-velden'!AJ94","v":34},{"$f":"+'HULP-velden'!AK94","v":44},{"$f":"+'HULP-velden'!AL94","v":54},{"$f":"+'HULP-velden'!AM94","v":64},{"$f":"+'HULP-velden'!AN94","v":74},{"$f":"+'HULP-velden'!AO94","v":84},{"$f":"+'HULP-velden'!AP94","v":94}]
[null,null,null,null,null,null,null,{"$f":"'HULP-velden'!AE95","v":427000},null,{"$f":"+'HULP-velden'!AJ95","v":33.5},{"$f":"+'HULP-velden'!AK95","v":43.5},{"$f":"+'HULP-velden'!AL95","v":53.5},{"$f":"+'HULP-velden'!AM95","v":63.5},{"$f":"+'HULP-velden'!AN95","v":73.5},{"$f":"+'HULP-velden'!AO95","v":83.5},{"$f":"+'HULP-velden'!AP95","v":93.5}]
[null,null,null,null,null,null,null,{"$f":"'HULP-velden'!AE96","v":426000},null,{"$f":"+'HULP-velden'!AJ96","v":33},{"$f":"+'HULP-velden'!AK96","v":43},{"$f":"+'HULP-velden'!AL96","v":53},{"$f":"+'HULP-velden'!AM96","v":63},{"$f":"+'HULP-velden'!AN96","v":73},{"$f":"+'HULP-velden'!AO96","v":83},{"$f":"+'HULP-velden'!AP96","v":93}]
[null,null,null,null,null,null,null,{"$f":"'HULP-velden'!AE97","v":425000},null,{"$f":"+'HULP-velden'!AJ97","v":32.5},{"$f":"+'HULP-velden'!AK97","v":42.5},{"$f":"+'HULP-velden'!AL97","v":52.5},{"$f":"+'HULP-velden'!AM97","v":62.5},{"$f":"+'HULP-velden'!AN97","v":72.5},{"$f":"+'HULP-velden'!AO97","v":82.5},{"$f":"+'HULP-velden'!AP97","v":92.5}]
[null,null,null,null,null,null,null,{"$f":"'HULP-velden'!AE98","v":424000},null,{"$f":"+'HULP-velden'!AJ98","v":32},{"$f":"+'HULP-velden'!AK98","v":42},{"$f":"+'HULP-velden'!AL98","v":52},{"$f":"+'HULP-velden'!AM98","v":62},{"$f":"+'HULP-velden'!AN98","v":72},{"$f":"+'HULP-velden'!AO98","v":82},{"$f":"+'HULP-velden'!AP98","v":92}]
[null,null,null,null,null,null,null,{"$f":"'HULP-velden'!AE99","v":423000},null,{"$f":"+'HULP-velden'!AJ99","v":31.5},{"$f":"+'HULP-velden'!AK99","v":41.5},{"$f":"+'HULP-velden'!AL99","v":51.5},{"$f":"+'HULP-velden'!AM99","v":61.5},{"$f":"+'HULP-velden'!AN99","v":71.5},{"$f":"+'HULP-velden'!AO99","v":81.5},{"$f":"+'HULP-velden'!AP99","v":91.5}]
[null,null,null,null,null,null,null,{"$f":"'HULP-velden'!AE100","v":422000},null,{"$f":"+'HULP-velden'!AJ100","v":31},{"$f":"+'HULP-velden'!AK100","v":41},{"$f":"+'HULP-velden'!AL100","v":51},{"$f":"+'HULP-velden'!AM100","v":61},{"$f":"+'HULP-velden'!AN100","v":71},{"$f":"+'HULP-velden'!AO100","v":81},{"$f":"+'HULP-velden'!AP100","v":91}]
[null,null,null,null,null,null,null,{"$f":"'HULP-velden'!AE101","v":421000},null,{"$f":"+'HULP-velden'!AJ101","v":30.5},{"$f":"+'HULP-velden'!AK101","v":40.5},{"$f":"+'HULP-velden'!AL101","v":50.5},{"$f":"+'HULP-velden'!AM101","v":60.5},{"$f":"+'HULP-velden'!AN101","v":70.5},{"$f":"+'HULP-velden'!AO101","v":80.5},{"$f":"+'HULP-velden'!AP101","v":90.5}]
[null,null,null,null,null,null,null,{"$f":"'HULP-velden'!AE102","v":420000},null,{"$f":"+'HULP-velden'!AJ102","v":30},{"$f":"+'HULP-velden'!AK102","v":40},{"$f":"+'HULP-velden'!AL102","v":50},{"$f":"+'HULP-velden'!AM102","v":60},{"$f":"+'HULP-velden'!AN102","v":70},{"$f":"+'HULP-velden'!AO102","v":80},{"$f":"+'HULP-velden'!AP102","v":90}]
[null,null,null,null,null,null,null,{"$f":"'HULP-velden'!AE103","v":419000},null,{"$f":"+'HULP-velden'!AJ103","v":29.5},{"$f":"+'HULP-velden'!AK103","v":39.5},{"$f":"+'HULP-velden'!AL103","v":49.5},{"$f":"+'HULP-velden'!AM103","v":59.5},{"$f":"+'HULP-velden'!AN103","v":69.5},{"$f":"+'HULP-velden'!AO103","v":79.5},{"$f":"+'HULP-velden'!AP103","v":89.5}]
[null,null,null,null,null,null,null,{"$f":"'HULP-velden'!AE104","v":418000},null,{"$f":"+'HULP-velden'!AJ104","v":28.999999999999996},{"$f":"+'HULP-velden'!AK104","v":39},{"$f":"+'HULP-velden'!AL104","v":49},{"$f":"+'HULP-velden'!AM104","v":59},{"$f":"+'HULP-velden'!AN104","v":69},{"$f":"+'HULP-velden'!AO104","v":79},{"$f":"+'HULP-velden'!AP104","v":89}]
[null,null,null,null,null,null,null,{"$f":"'HULP-velden'!AE105","v":417000},null,{"$f":"+'HULP-velden'!AJ105","v":28.499999999999996},{"$f":"+'HULP-velden'!AK105","v":38.5},{"$f":"+'HULP-velden'!AL105","v":48.5},{"$f":"+'HULP-velden'!AM105","v":58.5},{"$f":"+'HULP-velden'!AN105","v":68.5},{"$f":"+'HULP-velden'!AO105","v":78.5},{"$f":"+'HULP-velden'!AP105","v":88.5}]
[null,null,null,null,null,null,null,{"$f":"'HULP-velden'!AE106","v":416000},null,{"$f":"+'HULP-velden'!AJ106","v":28.000000000000004},{"$f":"+'HULP-velden'!AK106","v":38},{"$f":"+'HULP-velden'!AL106","v":48},{"$f":"+'HULP-velden'!AM106","v":57.999999999999993},{"$f":"+'HULP-velden'!AN106","v":68},{"$f":"+'HULP-velden'!AO106","v":78},{"$f":"+'HULP-velden'!AP106","v":88}]
[null,null,null,null,null,null,null,{"$f":"'HULP-velden'!AE107","v":415000},null,{"$f":"+'HULP-velden'!AJ107","v":27.500000000000004},{"$f":"+'HULP-velden'!AK107","v":37.5},{"$f":"+'HULP-velden'!AL107","v":47.5},{"$f":"+'HULP-velden'!AM107","v":57.499999999999993},{"$f":"+'HULP-velden'!AN107","v":67.5},{"$f":"+'HULP-velden'!AO107","v":77.5},{"$f":"+'HULP-velden'!AP107","v":87.5}]
[null,null,null,null,null,null,null,{"$f":"'HULP-velden'!AE108","v":414000},null,{"$f":"+'HULP-velden'!AJ108","v":27},{"$f":"+'HULP-velden'!AK108","v":37},{"$f":"+'HULP-velden'!AL108","v":47},{"$f":"+'HULP-velden'!AM108","v":56.999999999999993},{"$f":"+'HULP-velden'!AN108","v":67},{"$f":"+'HULP-velden'!AO108","v":77},{"$f":"+'HULP-velden'!AP108","v":87}]
[null,null,null,null,null,null,null,{"$f":"'HULP-velden'!AE109","v":413000},null,{"$f":"+'HULP-velden'!AJ109","v":26.5},{"$f":"+'HULP-velden'!AK109","v":36.5},{"$f":"+'HULP-velden'!AL109","v":46.5},{"$f":"+'HULP-velden'!AM109","v":56.499999999999993},{"$f":"+'HULP-velden'!AN109","v":66.5},{"$f":"+'HULP-velden'!AO109","v":76.5},{"$f":"+'HULP-velden'!AP109","v":86.5}]
[null,null,null,null,null,null,null,{"$f":"'HULP-velden'!AE110","v":412000},null,{"$f":"+'HULP-velden'!AJ110","v":26},{"$f":"+'HULP-velden'!AK110","v":36},{"$f":"+'HULP-velden'!AL110","v":46},{"$f":"+'HULP-velden'!AM110","v":56.000000000000007},{"$f":"+'HULP-velden'!AN110","v":66},{"$f":"+'HULP-velden'!AO110","v":76},{"$f":"+'HULP-velden'!AP110","v":86}]
[null,null,null,null,null,null,null,{"$f":"'HULP-velden'!AE111","v":411000},null,{"$f":"+'HULP-velden'!AJ111","v":25.5},{"$f":"+'HULP-velden'!AK111","v":35.5},{"$f":"+'HULP-velden'!AL111","v":45.5},{"$f":"+'HULP-velden'!AM111","v":55.500000000000007},{"$f":"+'HULP-velden'!AN111","v":65.5},{"$f":"+'HULP-velden'!AO111","v":75.5},{"$f":"+'HULP-velden'!AP111","v":85.5}]
[null,null,null,null,null,null,null,{"$f":"'HULP-velden'!AE112","v":410000},null,{"$f":"+'HULP-velden'!AJ112","v":25},{"$f":"+'HULP-velden'!AK112","v":35},{"$f":"+'HULP-velden'!AL112","v":45},{"$f":"+'HULP-velden'!AM112","v":55.000000000000007},{"$f":"+'HULP-velden'!AN112","v":65},{"$f":"+'HULP-velden'!AO112","v":75},{"$f":"+'HULP-velden'!AP112","v":85}]
[null,null,null,null,null,null,null,{"$f":"'HULP-velden'!AE113","v":409000},null,{"$f":"+'HULP-velden'!AJ113","v":24.5},{"$f":"+'HULP-velden'!AK113","v":34.5},{"$f":"+'HULP-velden'!AL113","v":44.5},{"$f":"+'HULP-velden'!AM113","v":54.500000000000007},{"$f":"+'HULP-velden'!AN113","v":64.5},{"$f":"+'HULP-velden'!AO113","v":74.5},{"$f":"+'HULP-velden'!AP113","v":84.5}]
[null,null,null,null,null,null,null,{"$f":"'HULP-velden'!AE114","v":408000},null,{"$f":"+'HULP-velden'!AJ114","v":24},{"$f":"+'HULP-velden'!AK114","v":34},{"$f":"+'HULP-velden'!AL114","v":44},{"$f":"+'HULP-velden'!AM114","v":54},{"$f":"+'HULP-velden'!AN114","v":64},{"$f":"+'HULP-velden'!AO114","v":74},{"$f":"+'HULP-velden'!AP114","v":84}]
[null,null,null,null,null,null,null,{"$f":"'HULP-velden'!AE115","v":407000},null,{"$f":"+'HULP-velden'!AJ115","v":23.5},{"$f":"+'HULP-velden'!AK115","v":33.5},{"$f":"+'HULP-velden'!AL115","v":43.5},{"$f":"+'HULP-velden'!AM115","v":53.5},{"$f":"+'HULP-velden'!AN115","v":63.5},{"$f":"+'HULP-velden'!AO115","v":73.5},{"$f":"+'HULP-velden'!AP115","v":83.5}]
[null,null,null,null,null,null,null,{"$f":"'HULP-velden'!AE116","v":406000},null,{"$f":"+'HULP-velden'!AJ116","v":23},{"$f":"+'HULP-velden'!AK116","v":33},{"$f":"+'HULP-velden'!AL116","v":43},{"$f":"+'HULP-velden'!AM116","v":53},{"$f":"+'HULP-velden'!AN116","v":63},{"$f":"+'HULP-velden'!AO116","v":73},{"$f":"+'HULP-velden'!AP116","v":83}]
[null,null,null,null,null,null,null,{"$f":"'HULP-velden'!AE117","v":405000},null,{"$f":"+'HULP-velden'!AJ117","v":22.5},{"$f":"+'HULP-velden'!AK117","v":32.5},{"$f":"+'HULP-velden'!AL117","v":42.5},{"$f":"+'HULP-velden'!AM117","v":52.5},{"$f":"+'HULP-velden'!AN117","v":62.5},{"$f":"+'HULP-velden'!AO117","v":72.5},{"$f":"+'HULP-velden'!AP117","v":82.5}]
[null,null,null,null,null,null,null,{"$f":"'HULP-velden'!AE118","v":404000},null,{"$f":"+'HULP-velden'!AJ118","v":22},{"$f":"+'HULP-velden'!AK118","v":32},{"$f":"+'HULP-velden'!AL118","v":42},{"$f":"+'HULP-velden'!AM118","v":52},{"$f":"+'HULP-velden'!AN118","v":62},{"$f":"+'HULP-velden'!AO118","v":72},{"$f":"+'HULP-velden'!AP118","v":82}]
[null,null,null,null,null,null,null,{"$f":"'HULP-velden'!AE119","v":403000},null,{"$f":"+'HULP-velden'!AJ119","v":21.5},{"$f":"+'HULP-velden'!AK119","v":31.5},{"$f":"+'HULP-velden'!AL119","v":41.5},{"$f":"+'HULP-velden'!AM119","v":51.5},{"$f":"+'HULP-velden'!AN119","v":61.5},{"$f":"+'HULP-velden'!AO119","v":71.5},{"$f":"+'HULP-velden'!AP119","v":81.5}]
[null,null,null,null,null,null,null,{"$f":"'HULP-velden'!AE120","v":402000},null,{"$f":"+'HULP-velden'!AJ120","v":21},{"$f":"+'HULP-velden'!AK120","v":31},{"$f":"+'HULP-velden'!AL120","v":41},{"$f":"+'HULP-velden'!AM120","v":51},{"$f":"+'HULP-velden'!AN120","v":61},{"$f":"+'HULP-velden'!AO120","v":71},{"$f":"+'HULP-velden'!AP120","v":81}]
[null,null,null,null,null,null,null,{"$f":"'HULP-velden'!AE121","v":401000},null,{"$f":"+'HULP-velden'!AJ121","v":20.5},{"$f":"+'HULP-velden'!AK121","v":30.5},{"$f":"+'HULP-velden'!AL121","v":40.5},{"$f":"+'HULP-velden'!AM121","v":50.5},{"$f":"+'HULP-velden'!AN121","v":60.5},{"$f":"+'HULP-velden'!AO121","v":70.5},{"$f":"+'HULP-velden'!AP121","v":80.5}]
[null,null,null,null,null,null,null,{"$f":"'HULP-velden'!AE122","v":400000},null,{"$f":"+'HULP-velden'!AJ122","v":20},{"$f":"+'HULP-velden'!AK122","v":30},{"$f":"+'HULP-velden'!AL122","v":40},{"$f":"+'HULP-velden'!AM122","v":50},{"$f":"+'HULP-velden'!AN122","v":60},{"$f":"+'HULP-velden'!AO122","v":70},{"$f":"+'HULP-velden'!AP122","v":80}]
[null,null,null,null,null,null,null,{"$f":"'HULP-velden'!AE123","v":399000},null,{"$f":"+'HULP-velden'!AJ123","v":19.5},{"$f":"+'HULP-velden'!AK123","v":29.5},{"$f":"+'HULP-velden'!AL123","v":39.5},{"$f":"+'HULP-velden'!AM123","v":49.5},{"$f":"+'HULP-velden'!AN123","v":59.5},{"$f":"+'HULP-velden'!AO123","v":69.5},{"$f":"+'HULP-velden'!AP123","v":79.5}]
[null,null,null,null,null,null,null,{"$f":"'HULP-velden'!AE124","v":398000},null,{"$f":"+'HULP-velden'!AJ124","v":19},{"$f":"+'HULP-velden'!AK124","v":28.999999999999996},{"$f":"+'HULP-velden'!AL124","v":39},{"$f":"+'HULP-velden'!AM124","v":49},{"$f":"+'HULP-velden'!AN124","v":59},{"$f":"+'HULP-velden'!AO124","v":69},{"$f":"+'HULP-velden'!AP124","v":79}]
[null,null,null,null,null,null,null,{"$f":"'HULP-velden'!AE125","v":397000},null,{"$f":"+'HULP-velden'!AJ125","v":18.5},{"$f":"+'HULP-velden'!AK125","v":28.499999999999996},{"$f":"+'HULP-velden'!AL125","v":38.5},{"$f":"+'HULP-velden'!AM125","v":48.5},{"$f":"+'HULP-velden'!AN125","v":58.5},{"$f":"+'HULP-velden'!AO125","v":68.5},{"$f":"+'HULP-velden'!AP125","v":78.5}]
[null,null,null,null,null,null,null,{"$f":"'HULP-velden'!AE126","v":396000},null,{"$f":"+'HULP-velden'!AJ126","v":18},{"$f":"+'HULP-velden'!AK126","v":28.000000000000004},{"$f":"+'HULP-velden'!AL126","v":38},{"$f":"+'HULP-velden'!AM126","v":48},{"$f":"+'HULP-velden'!AN126","v":57.999999999999993},{"$f":"+'HULP-velden'!AO126","v":68},{"$f":"+'HULP-velden'!AP126","v":78}]
[null,null,null,null,null,null,null,{"$f":"'HULP-velden'!AE127","v":395000},null,{"$f":"+'HULP-velden'!AJ127","v":17.5},{"$f":"+'HULP-velden'!AK127","v":27.500000000000004},{"$f":"+'HULP-velden'!AL127","v":37.5},{"$f":"+'HULP-velden'!AM127","v":47.5},{"$f":"+'HULP-velden'!AN127","v":57.499999999999993},{"$f":"+'HULP-velden'!AO127","v":67.5},{"$f":"+'HULP-velden'!AP127","v":77.5}]
[null,null,null,null,null,null,null,{"$f":"'HULP-velden'!AE128","v":394000},null,{"$f":"+'HULP-velden'!AJ128","v":17},{"$f":"+'HULP-velden'!AK128","v":27},{"$f":"+'HULP-velden'!AL128","v":37},{"$f":"+'HULP-velden'!AM128","v":47},{"$f":"+'HULP-velden'!AN128","v":56.999999999999993},{"$f":"+'HULP-velden'!AO128","v":67},{"$f":"+'HULP-velden'!AP128","v":77}]
[null,null,null,null,null,null,null,{"$f":"'HULP-velden'!AE129","v":393000},null,{"$f":"+'HULP-velden'!AJ129","v":16.5},{"$f":"+'HULP-velden'!AK129","v":26.5},{"$f":"+'HULP-velden'!AL129","v":36.5},{"$f":"+'HULP-velden'!AM129","v":46.5},{"$f":"+'HULP-velden'!AN129","v":56.499999999999993},{"$f":"+'HULP-velden'!AO129","v":66.5},{"$f":"+'HULP-velden'!AP129","v":76.5}]
[null,null,null,null,null,null,null,{"$f":"'HULP-velden'!AE130","v":392000},null,{"$f":"+'HULP-velden'!AJ130","v":16},{"$f":"+'HULP-velden'!AK130","v":26},{"$f":"+'HULP-velden'!AL130","v":36},{"$f":"+'HULP-velden'!AM130","v":46},{"$f":"+'HULP-velden'!AN130","v":56.000000000000007},{"$f":"+'HULP-velden'!AO130","v":66},{"$f":"+'HULP-velden'!AP130","v":76}]
[null,null,null,null,null,null,null,{"$f":"'HULP-velden'!AE131","v":391000},null,{"$f":"+'HULP-velden'!AJ131","v":15.5},{"$f":"+'HULP-velden'!AK131","v":25.5},{"$f":"+'HULP-velden'!AL131","v":35.5},{"$f":"+'HULP-velden'!AM131","v":45.5},{"$f":"+'HULP-velden'!AN131","v":55.500000000000007},{"$f":"+'HULP-velden'!AO131","v":65.5},{"$f":"+'HULP-velden'!AP131","v":75.5}]
[null,null,null,null,null,null,null,{"$f":"'HULP-velden'!AE132","v":390000},null,{"$f":"+'HULP-velden'!AJ132","v":15},{"$f":"+'HULP-velden'!AK132","v":25},{"$f":"+'HULP-velden'!AL132","v":35},{"$f":"+'HULP-velden'!AM132","v":45},{"$f":"+'HULP-velden'!AN132","v":55.000000000000007},{"$f":"+'HULP-velden'!AO132","v":65},{"$f":"+'HULP-velden'!AP132","v":75}]
[null,null,null,null,null,null,null,{"$f":"'HULP-velden'!AE133","v":389000},null,{"$f":"+'HULP-velden'!AJ133","v":14.499999999999998},{"$f":"+'HULP-velden'!AK133","v":24.5},{"$f":"+'HULP-velden'!AL133","v":34.5},{"$f":"+'HULP-velden'!AM133","v":44.5},{"$f":"+'HULP-velden'!AN133","v":54.500000000000007},{"$f":"+'HULP-velden'!AO133","v":64.5},{"$f":"+'HULP-velden'!AP133","v":74.5}]
[null,null,null,null,null,null,null,{"$f":"'HULP-velden'!AE134","v":388000},null,{"$f":"+'HULP-velden'!AJ134","v":14.000000000000002},{"$f":"+'HULP-velden'!AK134","v":24},{"$f":"+'HULP-velden'!AL134","v":34},{"$f":"+'HULP-velden'!AM134","v":44},{"$f":"+'HULP-velden'!AN134","v":54},{"$f":"+'HULP-velden'!AO134","v":64},{"$f":"+'HULP-velden'!AP134","v":74}]
[null,null,null,null,null,null,null,{"$f":"'HULP-velden'!AE135","v":387000},null,{"$f":"+'HULP-velden'!AJ135","v":13.5},{"$f":"+'HULP-velden'!AK135","v":23.5},{"$f":"+'HULP-velden'!AL135","v":33.5},{"$f":"+'HULP-velden'!AM135","v":43.5},{"$f":"+'HULP-velden'!AN135","v":53.5},{"$f":"+'HULP-velden'!AO135","v":63.5},{"$f":"+'HULP-velden'!AP135","v":73.5}]
[null,null,null,null,null,null,null,{"$f":"'HULP-velden'!AE136","v":386000},null,{"$f":"+'HULP-velden'!AJ136","v":13},{"$f":"+'HULP-velden'!AK136","v":23},{"$f":"+'HULP-velden'!AL136","v":33},{"$f":"+'HULP-velden'!AM136","v":43},{"$f":"+'HULP-velden'!AN136","v":53},{"$f":"+'HULP-velden'!AO136","v":63},{"$f":"+'HULP-velden'!AP136","v":73}]
[null,null,null,null,null,null,null,{"$f":"'HULP-velden'!AE137","v":385000},null,{"$f":"+'HULP-velden'!AJ137","v":12.5},{"$f":"+'HULP-velden'!AK137","v":22.5},{"$f":"+'HULP-velden'!AL137","v":32.5},{"$f":"+'HULP-velden'!AM137","v":42.5},{"$f":"+'HULP-velden'!AN137","v":52.5},{"$f":"+'HULP-velden'!AO137","v":62.5},{"$f":"+'HULP-velden'!AP137","v":72.5}]
[null,null,null,null,null,null,null,{"$f":"'HULP-velden'!AE138","v":384000},null,{"$f":"+'HULP-velden'!AJ138","v":12},{"$f":"+'HULP-velden'!AK138","v":22},{"$f":"+'HULP-velden'!AL138","v":32},{"$f":"+'HULP-velden'!AM138","v":42},{"$f":"+'HULP-velden'!AN138","v":52},{"$f":"+'HULP-velden'!AO138","v":62},{"$f":"+'HULP-velden'!AP138","v":72}]
[null,null,null,null,null,null,null,{"$f":"'HULP-velden'!AE139","v":383000},null,{"$f":"+'HULP-velden'!AJ139","v":11.5},{"$f":"+'HULP-velden'!AK139","v":21.5},{"$f":"+'HULP-velden'!AL139","v":31.5},{"$f":"+'HULP-velden'!AM139","v":41.5},{"$f":"+'HULP-velden'!AN139","v":51.5},{"$f":"+'HULP-velden'!AO139","v":61.5},{"$f":"+'HULP-velden'!AP139","v":71.5}]
[null,null,null,null,null,null,null,{"$f":"'HULP-velden'!AE140","v":382000},null,{"$f":"+'HULP-velden'!AJ140","v":11},{"$f":"+'HULP-velden'!AK140","v":21},{"$f":"+'HULP-velden'!AL140","v":31},{"$f":"+'HULP-velden'!AM140","v":41},{"$f":"+'HULP-velden'!AN140","v":51},{"$f":"+'HULP-velden'!AO140","v":61},{"$f":"+'HULP-velden'!AP140","v":71}]
[null,null,null,null,null,null,null,{"$f":"'HULP-velden'!AE141","v":381000},null,{"$f":"+'HULP-velden'!AJ141","v":10.5},{"$f":"+'HULP-velden'!AK141","v":20.5},{"$f":"+'HULP-velden'!AL141","v":30.5},{"$f":"+'HULP-velden'!AM141","v":40.5},{"$f":"+'HULP-velden'!AN141","v":50.5},{"$f":"+'HULP-velden'!AO141","v":60.5},{"$f":"+'HULP-velden'!AP141","v":70.5}]
[null,null,null,null,null,null,null,{"$f":"'HULP-velden'!AE142","v":380000},null,{"$f":"+'HULP-velden'!AJ142","v":10},{"$f":"+'HULP-velden'!AK142","v":20},{"$f":"+'HULP-velden'!AL142","v":30},{"$f":"+'HULP-velden'!AM142","v":40},{"$f":"+'HULP-velden'!AN142","v":50},{"$f":"+'HULP-velden'!AO142","v":60},{"$f":"+'HULP-velden'!AP142","v":70}]
[null,null,null,null,null,null,null,{"$f":"'HULP-velden'!AE143","v":379000},null,{"$f":"+'HULP-velden'!AJ143","v":9.5},{"$f":"+'HULP-velden'!AK143","v":19.5},{"$f":"+'HULP-velden'!AL143","v":29.5},{"$f":"+'HULP-velden'!AM143","v":39.5},{"$f":"+'HULP-velden'!AN143","v":49.5},{"$f":"+'HULP-velden'!AO143","v":59.5},{"$f":"+'HULP-velden'!AP143","v":69.5}]
[null,null,null,null,null,null,null,{"$f":"'HULP-velden'!AE144","v":378000},null,{"$f":"+'HULP-velden'!AJ144","v":9},{"$f":"+'HULP-velden'!AK144","v":19},{"$f":"+'HULP-velden'!AL144","v":28.999999999999996},{"$f":"+'HULP-velden'!AM144","v":39},{"$f":"+'HULP-velden'!AN144","v":49},{"$f":"+'HULP-velden'!AO144","v":59},{"$f":"+'HULP-velden'!AP144","v":69}]
[null,null,null,null,null,null,null,{"$f":"'HULP-velden'!AE145","v":377000},null,{"$f":"+'HULP-velden'!AJ145","v":8.5},{"$f":"+'HULP-velden'!AK145","v":18.5},{"$f":"+'HULP-velden'!AL145","v":28.499999999999996},{"$f":"+'HULP-velden'!AM145","v":38.5},{"$f":"+'HULP-velden'!AN145","v":48.5},{"$f":"+'HULP-velden'!AO145","v":58.5},{"$f":"+'HULP-velden'!AP145","v":68.5}]
[null,null,null,null,null,null,null,{"$f":"'HULP-velden'!AE146","v":376000},null,{"$f":"+'HULP-velden'!AJ146","v":8},{"$f":"+'HULP-velden'!AK146","v":18},{"$f":"+'HULP-velden'!AL146","v":28.000000000000004},{"$f":"+'HULP-velden'!AM146","v":38},{"$f":"+'HULP-velden'!AN146","v":48},{"$f":"+'HULP-velden'!AO146","v":57.999999999999993},{"$f":"+'HULP-velden'!AP146","v":68}]
[null,null,null,null,null,null,null,{"$f":"'HULP-velden'!AE147","v":375000},null,{"$f":"+'HULP-velden'!AJ147","v":7.5},{"$f":"+'HULP-velden'!AK147","v":17.5},{"$f":"+'HULP-velden'!AL147","v":27.500000000000004},{"$f":"+'HULP-velden'!AM147","v":37.5},{"$f":"+'HULP-velden'!AN147","v":47.5},{"$f":"+'HULP-velden'!AO147","v":57.499999999999993},{"$f":"+'HULP-velden'!AP147","v":67.5}]
[null,null,null,null,null,null,null,{"$f":"'HULP-velden'!AE148","v":374000},null,{"$f":"+'HULP-velden'!AJ148","v":7.0000000000000009},{"$f":"+'HULP-velden'!AK148","v":17},{"$f":"+'HULP-velden'!AL148","v":27},{"$f":"+'HULP-velden'!AM148","v":37},{"$f":"+'HULP-velden'!AN148","v":47},{"$f":"+'HULP-velden'!AO148","v":56.999999999999993},{"$f":"+'HULP-velden'!AP148","v":67}]
[null,null,null,null,null,null,null,{"$f":"'HULP-velden'!AE149","v":373000},null,{"$f":"+'HULP-velden'!AJ149","v":6.5},{"$f":"+'HULP-velden'!AK149","v":16.5},{"$f":"+'HULP-velden'!AL149","v":26.5},{"$f":"+'HULP-velden'!AM149","v":36.5},{"$f":"+'HULP-velden'!AN149","v":46.5},{"$f":"+'HULP-velden'!AO149","v":56.499999999999993},{"$f":"+'HULP-velden'!AP149","v":66.5}]
[null,null,null,null,null,null,null,{"$f":"'HULP-velden'!AE150","v":372000},null,{"$f":"+'HULP-velden'!AJ150","v":6},{"$f":"+'HULP-velden'!AK150","v":16},{"$f":"+'HULP-velden'!AL150","v":26},{"$f":"+'HULP-velden'!AM150","v":36},{"$f":"+'HULP-velden'!AN150","v":46},{"$f":"+'HULP-velden'!AO150","v":56.000000000000007},{"$f":"+'HULP-velden'!AP150","v":66}]
[null,null,null,null,null,null,null,{"$f":"'HULP-velden'!AE151","v":371000},null,{"$f":"+'HULP-velden'!AJ151","v":5.5},{"$f":"+'HULP-velden'!AK151","v":15.5},{"$f":"+'HULP-velden'!AL151","v":25.5},{"$f":"+'HULP-velden'!AM151","v":35.5},{"$f":"+'HULP-velden'!AN151","v":45.5},{"$f":"+'HULP-velden'!AO151","v":55.500000000000007},{"$f":"+'HULP-velden'!AP151","v":65.5}]
[null,null,null,null,null,null,null,{"$f":"'HULP-velden'!AE152","v":370000},null,{"$f":"+'HULP-velden'!AJ152","v":5},{"$f":"+'HULP-velden'!AK152","v":15},{"$f":"+'HULP-velden'!AL152","v":25},{"$f":"+'HULP-velden'!AM152","v":35},{"$f":"+'HULP-velden'!AN152","v":45},{"$f":"+'HULP-velden'!AO152","v":55.000000000000007},{"$f":"+'HULP-velden'!AP152","v":65}]
[null,null,null,null,null,null,null,{"$f":"'HULP-velden'!AE153","v":369000},null,{"$f":"+'HULP-velden'!AJ153","v":4.5},{"$f":"+'HULP-velden'!AK153","v":14.499999999999998},{"$f":"+'HULP-velden'!AL153","v":24.5},{"$f":"+'HULP-velden'!AM153","v":34.5},{"$f":"+'HULP-velden'!AN153","v":44.5},{"$f":"+'HULP-velden'!AO153","v":54.500000000000007},{"$f":"+'HULP-velden'!AP153","v":64.5}]
[null,null,null,null,null,null,null,{"$f":"'HULP-velden'!AE154","v":368000},null,{"$f":"+'HULP-velden'!AJ154","v":4},{"$f":"+'HULP-velden'!AK154","v":14.000000000000002},{"$f":"+'HULP-velden'!AL154","v":24},{"$f":"+'HULP-velden'!AM154","v":34},{"$f":"+'HULP-velden'!AN154","v":44},{"$f":"+'HULP-velden'!AO154","v":54},{"$f":"+'HULP-velden'!AP154","v":64}]
[null,null,null,null,null,null,null,{"$f":"'HULP-velden'!AE155","v":367000},null,{"$f":"+'HULP-velden'!AJ155","v":3.5000000000000004},{"$f":"+'HULP-velden'!AK155","v":13.5},{"$f":"+'HULP-velden'!AL155","v":23.5},{"$f":"+'HULP-velden'!AM155","v":33.5},{"$f":"+'HULP-velden'!AN155","v":43.5},{"$f":"+'HULP-velden'!AO155","v":53.5},{"$f":"+'HULP-velden'!AP155","v":63.5}]
[null,null,null,null,null,null,null,{"$f":"'HULP-velden'!AE156","v":366000},null,{"$f":"+'HULP-velden'!AJ156","v":3},{"$f":"+'HULP-velden'!AK156","v":13},{"$f":"+'HULP-velden'!AL156","v":23},{"$f":"+'HULP-velden'!AM156","v":33},{"$f":"+'HULP-velden'!AN156","v":43},{"$f":"+'HULP-velden'!AO156","v":53},{"$f":"+'HULP-velden'!AP156","v":63}]
[null,null,null,null,null,null,null,{"$f":"'HULP-velden'!AE157","v":365000},null,{"$f":"+'HULP-velden'!AJ157","v":2.5},{"$f":"+'HULP-velden'!AK157","v":12.5},{"$f":"+'HULP-velden'!AL157","v":22.5},{"$f":"+'HULP-velden'!AM157","v":32.5},{"$f":"+'HULP-velden'!AN157","v":42.5},{"$f":"+'HULP-velden'!AO157","v":52.5},{"$f":"+'HULP-velden'!AP157","v":62.5}]
[null,null,null,null,null,null,null,{"$f":"'HULP-velden'!AE158","v":364000},null,{"$f":"+'HULP-velden'!AJ158","v":2},{"$f":"+'HULP-velden'!AK158","v":12},{"$f":"+'HULP-velden'!AL158","v":22},{"$f":"+'HULP-velden'!AM158","v":32},{"$f":"+'HULP-velden'!AN158","v":42},{"$f":"+'HULP-velden'!AO158","v":52},{"$f":"+'HULP-velden'!AP158","v":62}]
[null,null,null,null,null,null,null,{"$f":"'HULP-velden'!AE159","v":363000},null,{"$f":"+'HULP-velden'!AJ159","v":1.5},{"$f":"+'HULP-velden'!AK159","v":11.5},{"$f":"+'HULP-velden'!AL159","v":21.5},{"$f":"+'HULP-velden'!AM159","v":31.5},{"$f":"+'HULP-velden'!AN159","v":41.5},{"$f":"+'HULP-velden'!AO159","v":51.5},{"$f":"+'HULP-velden'!AP159","v":61.5}]
[null,null,null,null,null,null,null,{"$f":"'HULP-velden'!AE160","v":362000},null,{"$f":"+'HULP-velden'!AJ160","v":1},{"$f":"+'HULP-velden'!AK160","v":11},{"$f":"+'HULP-velden'!AL160","v":21},{"$f":"+'HULP-velden'!AM160","v":31},{"$f":"+'HULP-velden'!AN160","v":41},{"$f":"+'HULP-velden'!AO160","v":51},{"$f":"+'HULP-velden'!AP160","v":61}]
[null,null,null,null,null,null,null,{"$f":"'HULP-velden'!AE161","v":361000},null,{"$f":"+'HULP-velden'!AJ161","v":0.5},{"$f":"+'HULP-velden'!AK161","v":10.5},{"$f":"+'HULP-velden'!AL161","v":20.5},{"$f":"+'HULP-velden'!AM161","v":30.5},{"$f":"+'HULP-velden'!AN161","v":40.5},{"$f":"+'HULP-velden'!AO161","v":50.5},{"$f":"+'HULP-velden'!AP161","v":60.5}]
[null,null,null,null,null,null,null,{"$f":"'HULP-velden'!AE162","v":360000},null,{"$f":"+'HULP-velden'!AJ162","v":0},{"$f":"+'HULP-velden'!AK162","v":10},{"$f":"+'HULP-velden'!AL162","v":20},{"$f":"+'HULP-velden'!AM162","v":30},{"$f":"+'HULP-velden'!AN162","v":40},{"$f":"+'HULP-velden'!AO162","v":50},{"$f":"+'HULP-velden'!AP162","v":60}]
[null,null,null,null,null,null,null,{"$f":"'HULP-velden'!AE163","v":359000},null,{"$f":"+'HULP-velden'!AJ163","v":-0.5},{"$f":"+'HULP-velden'!AK163","v":9.5},{"$f":"+'HULP-velden'!AL163","v":19.5},{"$f":"+'HULP-velden'!AM163","v":29.5},{"$f":"+'HULP-velden'!AN163","v":39.5},{"$f":"+'HULP-velden'!AO163","v":49.5},{"$f":"+'HULP-velden'!AP163","v":59.5}]
[null,null,null,null,null,null,null,{"$f":"'HULP-velden'!AE164","v":358000},null,{"$f":"+'HULP-velden'!AJ164","v":-1},{"$f":"+'HULP-velden'!AK164","v":9},{"$f":"+'HULP-velden'!AL164","v":19},{"$f":"+'HULP-velden'!AM164","v":28.999999999999996},{"$f":"+'HULP-velden'!AN164","v":39},{"$f":"+'HULP-velden'!AO164","v":49},{"$f":"+'HULP-velden'!AP164","v":59}]
[null,null,null,null,null,null,null,{"$f":"'HULP-velden'!AE165","v":357000},null,{"$f":"+'HULP-velden'!AJ165","v":-1.5},{"$f":"+'HULP-velden'!AK165","v":8.5},{"$f":"+'HULP-velden'!AL165","v":18.5},{"$f":"+'HULP-velden'!AM165","v":28.499999999999996},{"$f":"+'HULP-velden'!AN165","v":38.5},{"$f":"+'HULP-velden'!AO165","v":48.5},{"$f":"+'HULP-velden'!AP165","v":58.5}]
[null,null,null,null,null,null,null,{"$f":"'HULP-velden'!AE167","v":356000},null,{"$f":"+'HULP-velden'!AJ167","v":-2},{"$f":"+'HULP-velden'!AK167","v":8},{"$f":"+'HULP-velden'!AL167","v":18},{"$f":"+'HULP-velden'!AM167","v":28.000000000000004},{"$f":"+'HULP-velden'!AN167","v":38},{"$f":"+'HULP-velden'!AO167","v":48},{"$f":"+'HULP-velden'!AP167","v":57.999999999999993}]
[null,null,null,null,null,null,null,{"$f":"'HULP-velden'!AE168","v":355000},null,{"$f":"+'HULP-velden'!AJ168","v":-2.5},{"$f":"+'HULP-velden'!AK168","v":7.5},{"$f":"+'HULP-velden'!AL168","v":17.5},{"$f":"+'HULP-velden'!AM168","v":27.500000000000004},{"$f":"+'HULP-velden'!AN168","v":37.5},{"$f":"+'HULP-velden'!AO168","v":47.5},{"$f":"+'HULP-velden'!AP168","v":57.499999999999993}]
[null,null,null,null,null,null,null,{"$f":"'HULP-velden'!AE169","v":354000},null,{"$f":"+'HULP-velden'!AJ169","v":-3},{"$f":"+'HULP-velden'!AK169","v":7.0000000000000009},{"$f":"+'HULP-velden'!AL169","v":17},{"$f":"+'HULP-velden'!AM169","v":27},{"$f":"+'HULP-velden'!AN169","v":37},{"$f":"+'HULP-velden'!AO169","v":47},{"$f":"+'HULP-velden'!AP169","v":56.999999999999993}]
[null,null,null,null,null,null,null,{"$f":"'HULP-velden'!AE170","v":353000},null,{"$f":"+'HULP-velden'!AJ170","v":-3.5000000000000004},{"$f":"+'HULP-velden'!AK170","v":6.5},{"$f":"+'HULP-velden'!AL170","v":16.5},{"$f":"+'HULP-velden'!AM170","v":26.5},{"$f":"+'HULP-velden'!AN170","v":36.5},{"$f":"+'HULP-velden'!AO170","v":46.5},{"$f":"+'HULP-velden'!AP170","v":56.499999999999993}]
[null,null,null,null,null,null,null,{"$f":"'HULP-velden'!AE171","v":352000},null,{"$f":"+'HULP-velden'!AJ171","v":-4},{"$f":"+'HULP-velden'!AK171","v":6},{"$f":"+'HULP-velden'!AL171","v":16},{"$f":"+'HULP-velden'!AM171","v":26},{"$f":"+'HULP-velden'!AN171","v":36},{"$f":"+'HULP-velden'!AO171","v":46},{"$f":"+'HULP-velden'!AP171","v":56.000000000000007}]
[null,null,null,null,null,null,null,{"$f":"'HULP-velden'!AE172","v":351000},null,{"$f":"+'HULP-velden'!AJ172","v":-4.5},{"$f":"+'HULP-velden'!AK172","v":5.5},{"$f":"+'HULP-velden'!AL172","v":15.5},{"$f":"+'HULP-velden'!AM172","v":25.5},{"$f":"+'HULP-velden'!AN172","v":35.5},{"$f":"+'HULP-velden'!AO172","v":45.5},{"$f":"+'HULP-velden'!AP172","v":55.500000000000007}]
[null,null,null,null,null,null,null,{"$f":"'HULP-velden'!AE173","v":350000},null,{"$f":"+'HULP-velden'!AJ173","v":-5},{"$f":"+'HULP-velden'!AK173","v":5},{"$f":"+'HULP-velden'!AL173","v":15},{"$f":"+'HULP-velden'!AM173","v":25},{"$f":"+'HULP-velden'!AN173","v":35},{"$f":"+'HULP-velden'!AO173","v":45},{"$f":"+'HULP-velden'!AP173","v":55.000000000000007}]
[null,null,null,null,null,null,null,{"$f":"'HULP-velden'!AE174","v":349000},null,{"$f":"+'HULP-velden'!AJ174","v":-5.5},{"$f":"+'HULP-velden'!AK174","v":4.5},{"$f":"+'HULP-velden'!AL174","v":14.499999999999998},{"$f":"+'HULP-velden'!AM174","v":24.5},{"$f":"+'HULP-velden'!AN174","v":34.5},{"$f":"+'HULP-velden'!AO174","v":44.5},{"$f":"+'HULP-velden'!AP174","v":54.500000000000007}]
[null,null,null,null,null,null,null,{"$f":"'HULP-velden'!AE175","v":348000},null,{"$f":"+'HULP-velden'!AJ175","v":-6},{"$f":"+'HULP-velden'!AK175","v":4},{"$f":"+'HULP-velden'!AL175","v":14.000000000000002},{"$f":"+'HULP-velden'!AM175","v":24},{"$f":"+'HULP-velden'!AN175","v":34},{"$f":"+'HULP-velden'!AO175","v":44},{"$f":"+'HULP-velden'!AP175","v":54}]
[null,null,null,null,null,null,null,{"$f":"'HULP-velden'!AE176","v":347000},null,{"$f":"+'HULP-velden'!AJ176","v":-6.5},{"$f":"+'HULP-velden'!AK176","v":3.5000000000000004},{"$f":"+'HULP-velden'!AL176","v":13.5},{"$f":"+'HULP-velden'!AM176","v":23.5},{"$f":"+'HULP-velden'!AN176","v":33.5},{"$f":"+'HULP-velden'!AO176","v":43.5},{"$f":"+'HULP-velden'!AP176","v":53.5}]
[null,null,null,null,null,null,null,{"$f":"'HULP-velden'!AE177","v":346000},null,{"$f":"+'HULP-velden'!AJ177","v":-7.0000000000000009},{"$f":"+'HULP-velden'!AK177","v":3},{"$f":"+'HULP-velden'!AL177","v":13},{"$f":"+'HULP-velden'!AM177","v":23},{"$f":"+'HULP-velden'!AN177","v":33},{"$f":"+'HULP-velden'!AO177","v":43},{"$f":"+'HULP-velden'!AP177","v":53}]
[null,null,null,null,null,null,null,{"$f":"'HULP-velden'!AE178","v":345000},null,{"$f":"+'HULP-velden'!AJ178","v":-7.5},{"$f":"+'HULP-velden'!AK178","v":2.5},{"$f":"+'HULP-velden'!AL178","v":12.5},{"$f":"+'HULP-velden'!AM178","v":22.5},{"$f":"+'HULP-velden'!AN178","v":32.5},{"$f":"+'HULP-velden'!AO178","v":42.5},{"$f":"+'HULP-velden'!AP178","v":52.5}]
[null,null,null,null,null,null,null,{"$f":"'HULP-velden'!AE179","v":344000},null,{"$f":"+'HULP-velden'!AJ179","v":-8},{"$f":"+'HULP-velden'!AK179","v":2},{"$f":"+'HULP-velden'!AL179","v":12},{"$f":"+'HULP-velden'!AM179","v":22},{"$f":"+'HULP-velden'!AN179","v":32},{"$f":"+'HULP-velden'!AO179","v":42},{"$f":"+'HULP-velden'!AP179","v":52}]
[null,null,null,null,null,null,null,{"$f":"'HULP-velden'!AE180","v":343000},null,{"$f":"+'HULP-velden'!AJ180","v":-8.5},{"$f":"+'HULP-velden'!AK180","v":1.5},{"$f":"+'HULP-velden'!AL180","v":11.5},{"$f":"+'HULP-velden'!AM180","v":21.5},{"$f":"+'HULP-velden'!AN180","v":31.5},{"$f":"+'HULP-velden'!AO180","v":41.5},{"$f":"+'HULP-velden'!AP180","v":51.5}]
[null,null,null,null,null,null,null,{"$f":"'HULP-velden'!AE181","v":342000},null,{"$f":"+'HULP-velden'!AJ181","v":-9},{"$f":"+'HULP-velden'!AK181","v":1},{"$f":"+'HULP-velden'!AL181","v":11},{"$f":"+'HULP-velden'!AM181","v":21},{"$f":"+'HULP-velden'!AN181","v":31},{"$f":"+'HULP-velden'!AO181","v":41},{"$f":"+'HULP-velden'!AP181","v":51}]
[null,null,null,null,null,null,null,{"$f":"'HULP-velden'!AE182","v":341000},null,{"$f":"+'HULP-velden'!AJ182","v":-9.5},{"$f":"+'HULP-velden'!AK182","v":0.5},{"$f":"+'HULP-velden'!AL182","v":10.5},{"$f":"+'HULP-velden'!AM182","v":20.5},{"$f":"+'HULP-velden'!AN182","v":30.5},{"$f":"+'HULP-velden'!AO182","v":40.5},{"$f":"+'HULP-velden'!AP182","v":50.5}]
[null,null,null,null,null,null,null,{"$f":"'HULP-velden'!AE183","v":340000},null,{"$f":"+'HULP-velden'!AJ183","v":-10},{"$f":"+'HULP-velden'!AK183","v":0},{"$f":"+'HULP-velden'!AL183","v":10},{"$f":"+'HULP-velden'!AM183","v":20},{"$f":"+'HULP-velden'!AN183","v":30},{"$f":"+'HULP-velden'!AO183","v":40},{"$f":"+'HULP-velden'!AP183","v":50}]
[null,null,null,null,null,null,null,{"$f":"'HULP-velden'!AE184","v":339000},null,{"$f":"+'HULP-velden'!AJ184","v":-10.5},{"$f":"+'HULP-velden'!AK184","v":-0.5},{"$f":"+'HULP-velden'!AL184","v":9.5},{"$f":"+'HULP-velden'!AM184","v":19.5},{"$f":"+'HULP-velden'!AN184","v":29.5},{"$f":"+'HULP-velden'!AO184","v":39.5},{"$f":"+'HULP-velden'!AP184","v":49.5}]
[null,null,null,null,null,null,null,{"$f":"'HULP-velden'!AE185","v":338000},null,{"$f":"+'HULP-velden'!AJ185","v":-11},{"$f":"+'HULP-velden'!AK185","v":-1},{"$f":"+'HULP-velden'!AL185","v":9},{"$f":"+'HULP-velden'!AM185","v":19},{"$f":"+'HULP-velden'!AN185","v":28.999999999999996},{"$f":"+'HULP-velden'!AO185","v":39},{"$f":"+'HULP-velden'!AP185","v":49}]
[null,null,null,null,null,null,null,{"$f":"'HULP-velden'!AE186","v":337000},null,{"$f":"+'HULP-velden'!AJ186","v":-11.5},{"$f":"+'HULP-velden'!AK186","v":-1.5},{"$f":"+'HULP-velden'!AL186","v":8.5},{"$f":"+'HULP-velden'!AM186","v":18.5},{"$f":"+'HULP-velden'!AN186","v":28.499999999999996},{"$f":"+'HULP-velden'!AO186","v":38.5},{"$f":"+'HULP-velden'!AP186","v":48.5}]
[null,null,null,null,null,null,null,{"$f":"'HULP-velden'!AE187","v":336000},null,{"$f":"+'HULP-velden'!AJ187","v":-12},{"$f":"+'HULP-velden'!AK187","v":-2},{"$f":"+'HULP-velden'!AL187","v":8},{"$f":"+'HULP-velden'!AM187","v":18},{"$f":"+'HULP-velden'!AN187","v":28.000000000000004},{"$f":"+'HULP-velden'!AO187","v":38},{"$f":"+'HULP-velden'!AP187","v":48}]
[null,null,null,null,null,null,null,{"$f":"'HULP-velden'!AE188","v":335000},null,{"$f":"+'HULP-velden'!AJ188","v":-12.5},{"$f":"+'HULP-velden'!AK188","v":-2.5},{"$f":"+'HULP-velden'!AL188","v":7.5},{"$f":"+'HULP-velden'!AM188","v":17.5},{"$f":"+'HULP-velden'!AN188","v":27.500000000000004},{"$f":"+'HULP-velden'!AO188","v":37.5},{"$f":"+'HULP-velden'!AP188","v":47.5}]
[null,null,null,null,null,null,null,{"$f":"'HULP-velden'!AE189","v":334000},null,{"$f":"+'HULP-velden'!AJ189","v":-13},{"$f":"+'HULP-velden'!AK189","v":-3},{"$f":"+'HULP-velden'!AL189","v":7.0000000000000009},{"$f":"+'HULP-velden'!AM189","v":17},{"$f":"+'HULP-velden'!AN189","v":27},{"$f":"+'HULP-velden'!AO189","v":37},{"$f":"+'HULP-velden'!AP189","v":47}]
[null,null,null,null,null,null,null,{"$f":"'HULP-velden'!AE190","v":333000},null,{"$f":"+'HULP-velden'!AJ190","v":-13.5},{"$f":"+'HULP-velden'!AK190","v":-3.5000000000000004},{"$f":"+'HULP-velden'!AL190","v":6.5},{"$f":"+'HULP-velden'!AM190","v":16.5},{"$f":"+'HULP-velden'!AN190","v":26.5},{"$f":"+'HULP-velden'!AO190","v":36.5},{"$f":"+'HULP-velden'!AP190","v":46.5}]
[null,null,null,null,null,null,null,{"$f":"'HULP-velden'!AE191","v":332000},null,{"$f":"+'HULP-velden'!AJ191","v":-14.000000000000002},{"$f":"+'HULP-velden'!AK191","v":-4},{"$f":"+'HULP-velden'!AL191","v":6},{"$f":"+'HULP-velden'!AM191","v":16},{"$f":"+'HULP-velden'!AN191","v":26},{"$f":"+'HULP-velden'!AO191","v":36},{"$f":"+'HULP-velden'!AP191","v":46}]
[null,null,null,null,null,null,null,{"$f":"'HULP-velden'!AE192","v":331000},null,{"$f":"+'HULP-velden'!AJ192","v":-14.499999999999998},{"$f":"+'HULP-velden'!AK192","v":-4.5},{"$f":"+'HULP-velden'!AL192","v":5.5},{"$f":"+'HULP-velden'!AM192","v":15.5},{"$f":"+'HULP-velden'!AN192","v":25.5},{"$f":"+'HULP-velden'!AO192","v":35.5},{"$f":"+'HULP-velden'!AP192","v":45.5}]
[null,null,null,null,null,null,null,{"$f":"'HULP-velden'!AE193","v":330000},null,{"$f":"+'HULP-velden'!AJ193","v":-15},{"$f":"+'HULP-velden'!AK193","v":-5},{"$f":"+'HULP-velden'!AL193","v":5},{"$f":"+'HULP-velden'!AM193","v":15},{"$f":"+'HULP-velden'!AN193","v":25},{"$f":"+'HULP-velden'!AO193","v":35},{"$f":"+'HULP-velden'!AP193","v":45}]
[null,null,null,null,null,null,null,{"$f":"'HULP-velden'!AE194","v":329000},null,{"$f":"+'HULP-velden'!AJ194","v":-15.5},{"$f":"+'HULP-velden'!AK194","v":-5.5},{"$f":"+'HULP-velden'!AL194","v":4.5},{"$f":"+'HULP-velden'!AM194","v":14.499999999999998},{"$f":"+'HULP-velden'!AN194","v":24.5},{"$f":"+'HULP-velden'!AO194","v":34.5},{"$f":"+'HULP-velden'!AP194","v":44.5}]
[null,null,null,null,null,null,null,{"$f":"'HULP-velden'!AE195","v":328000},null,{"$f":"+'HULP-velden'!AJ195","v":-16},{"$f":"+'HULP-velden'!AK195","v":-6},{"$f":"+'HULP-velden'!AL195","v":4},{"$f":"+'HULP-velden'!AM195","v":14.000000000000002},{"$f":"+'HULP-velden'!AN195","v":24},{"$f":"+'HULP-velden'!AO195","v":34},{"$f":"+'HULP-velden'!AP195","v":44}]
[null,null,null,null,null,null,null,{"$f":"'HULP-velden'!AE196","v":327000},null,{"$f":"+'HULP-velden'!AJ196","v":-16.5},{"$f":"+'HULP-velden'!AK196","v":-6.5},{"$f":"+'HULP-velden'!AL196","v":3.5000000000000004},{"$f":"+'HULP-velden'!AM196","v":13.5},{"$f":"+'HULP-velden'!AN196","v":23.5},{"$f":"+'HULP-velden'!AO196","v":33.5},{"$f":"+'HULP-velden'!AP196","v":43.5}]
[null,null,null,null,null,null,null,{"$f":"'HULP-velden'!AE197","v":326000},null,{"$f":"+'HULP-velden'!AJ197","v":-17},{"$f":"+'HULP-velden'!AK197","v":-7.0000000000000009},{"$f":"+'HULP-velden'!AL197","v":3},{"$f":"+'HULP-velden'!AM197","v":13},{"$f":"+'HULP-velden'!AN197","v":23},{"$f":"+'HULP-velden'!AO197","v":33},{"$f":"+'HULP-velden'!AP197","v":43}]
[null,null,null,null,null,null,null,{"$f":"'HULP-velden'!AE198","v":325000},null,{"$f":"+'HULP-velden'!AJ198","v":-17.5},{"$f":"+'HULP-velden'!AK198","v":-7.5},{"$f":"+'HULP-velden'!AL198","v":2.5},{"$f":"+'HULP-velden'!AM198","v":12.5},{"$f":"+'HULP-velden'!AN198","v":22.5},{"$f":"+'HULP-velden'!AO198","v":32.5},{"$f":"+'HULP-velden'!AP198","v":42.5}]
[null,null,null,null,null,null,null,{"$f":"'HULP-velden'!AE199","v":324000},null,{"$f":"+'HULP-velden'!AJ199","v":-18},{"$f":"+'HULP-velden'!AK199","v":-8},{"$f":"+'HULP-velden'!AL199","v":2},{"$f":"+'HULP-velden'!AM199","v":12},{"$f":"+'HULP-velden'!AN199","v":22},{"$f":"+'HULP-velden'!AO199","v":32},{"$f":"+'HULP-velden'!AP199","v":42}]
[null,null,null,null,null,null,null,{"$f":"'HULP-velden'!AE200","v":323000},null,{"$f":"+'HULP-velden'!AJ200","v":-18.5},{"$f":"+'HULP-velden'!AK200","v":-8.5},{"$f":"+'HULP-velden'!AL200","v":1.5},{"$f":"+'HULP-velden'!AM200","v":11.5},{"$f":"+'HULP-velden'!AN200","v":21.5},{"$f":"+'HULP-velden'!AO200","v":31.5},{"$f":"+'HULP-velden'!AP200","v":41.5}]
[null,null,null,null,null,null,null,{"$f":"'HULP-velden'!AE201","v":322000},null,{"$f":"+'HULP-velden'!AJ201","v":-19},{"$f":"+'HULP-velden'!AK201","v":-9},{"$f":"+'HULP-velden'!AL201","v":1},{"$f":"+'HULP-velden'!AM201","v":11},{"$f":"+'HULP-velden'!AN201","v":21},{"$f":"+'HULP-velden'!AO201","v":31},{"$f":"+'HULP-velden'!AP201","v":41}]
[null,null,null,null,null,null,null,{"$f":"'HULP-velden'!AE202","v":321000},null,{"$f":"+'HULP-velden'!AJ202","v":-19.5},{"$f":"+'HULP-velden'!AK202","v":-9.5},{"$f":"+'HULP-velden'!AL202","v":0.5},{"$f":"+'HULP-velden'!AM202","v":10.5},{"$f":"+'HULP-velden'!AN202","v":20.5},{"$f":"+'HULP-velden'!AO202","v":30.5},{"$f":"+'HULP-velden'!AP202","v":40.5}]
[null,null,null,null,null,null,null,{"$f":"'HULP-velden'!AE203","v":320000},null,{"$f":"+'HULP-velden'!AJ203","v":-20},{"$f":"+'HULP-velden'!AK203","v":-10},{"$f":"+'HULP-velden'!AL203","v":0},{"$f":"+'HULP-velden'!AM203","v":10},{"$f":"+'HULP-velden'!AN203","v":20},{"$f":"+'HULP-velden'!AO203","v":30},{"$f":"+'HULP-velden'!AP203","v":40}]
[null,null,null,null,null,null,null,{"$f":"'HULP-velden'!AE204","v":319000},null,{"$f":"+'HULP-velden'!AJ204","v":-20.5},{"$f":"+'HULP-velden'!AK204","v":-10.5},{"$f":"+'HULP-velden'!AL204","v":-0.5},{"$f":"+'HULP-velden'!AM204","v":9.5},{"$f":"+'HULP-velden'!AN204","v":19.5},{"$f":"+'HULP-velden'!AO204","v":29.5},{"$f":"+'HULP-velden'!AP204","v":39.5}]
[null,null,null,null,null,null,null,{"$f":"'HULP-velden'!AE205","v":318000},null,{"$f":"+'HULP-velden'!AJ205","v":-21},{"$f":"+'HULP-velden'!AK205","v":-11},{"$f":"+'HULP-velden'!AL205","v":-1},{"$f":"+'HULP-velden'!AM205","v":9},{"$f":"+'HULP-velden'!AN205","v":19},{"$f":"+'HULP-velden'!AO205","v":28.999999999999996},{"$f":"+'HULP-velden'!AP205","v":39}]
[null,null,null,null,null,null,null,{"$f":"'HULP-velden'!AE206","v":317000},null,{"$f":"+'HULP-velden'!AJ206","v":-21.5},{"$f":"+'HULP-velden'!AK206","v":-11.5},{"$f":"+'HULP-velden'!AL206","v":-1.5},{"$f":"+'HULP-velden'!AM206","v":8.5},{"$f":"+'HULP-velden'!AN206","v":18.5},{"$f":"+'HULP-velden'!AO206","v":28.499999999999996},{"$f":"+'HULP-velden'!AP206","v":38.5}]
[null,null,null,null,null,null,null,{"$f":"'HULP-velden'!AE207","v":316000},null,{"$f":"+'HULP-velden'!AJ207","v":-22},{"$f":"+'HULP-velden'!AK207","v":-12},{"$f":"+'HULP-velden'!AL207","v":-2},{"$f":"+'HULP-velden'!AM207","v":8},{"$f":"+'HULP-velden'!AN207","v":18},{"$f":"+'HULP-velden'!AO207","v":28.000000000000004},{"$f":"+'HULP-velden'!AP207","v":38}]
[null,null,null,null,null,null,null,{"$f":"'HULP-velden'!AE208","v":315000},null,{"$f":"+'HULP-velden'!AJ208","v":-22.5},{"$f":"+'HULP-velden'!AK208","v":-12.5},{"$f":"+'HULP-velden'!AL208","v":-2.5},{"$f":"+'HULP-velden'!AM208","v":7.5},{"$f":"+'HULP-velden'!AN208","v":17.5},{"$f":"+'HULP-velden'!AO208","v":27.500000000000004},{"$f":"+'HULP-velden'!AP208","v":37.5}]
[null,null,null,null,null,null,null,{"$f":"'HULP-velden'!AE209","v":314000},null,{"$f":"+'HULP-velden'!AJ209","v":-23},{"$f":"+'HULP-velden'!AK209","v":-13},{"$f":"+'HULP-velden'!AL209","v":-3},{"$f":"+'HULP-velden'!AM209","v":7.0000000000000009},{"$f":"+'HULP-velden'!AN209","v":17},{"$f":"+'HULP-velden'!AO209","v":27},{"$f":"+'HULP-velden'!AP209","v":37}]
[null,null,null,null,null,null,null,{"$f":"'HULP-velden'!AE210","v":313000},null,{"$f":"+'HULP-velden'!AJ210","v":-23.5},{"$f":"+'HULP-velden'!AK210","v":-13.5},{"$f":"+'HULP-velden'!AL210","v":-3.5000000000000004},{"$f":"+'HULP-velden'!AM210","v":6.5},{"$f":"+'HULP-velden'!AN210","v":16.5},{"$f":"+'HULP-velden'!AO210","v":26.5},{"$f":"+'HULP-velden'!AP210","v":36.5}]
[null,null,null,null,null,null,null,{"$f":"'HULP-velden'!AE211","v":312000},null,{"$f":"+'HULP-velden'!AJ211","v":-24},{"$f":"+'HULP-velden'!AK211","v":-14.000000000000002},{"$f":"+'HULP-velden'!AL211","v":-4},{"$f":"+'HULP-velden'!AM211","v":6},{"$f":"+'HULP-velden'!AN211","v":16},{"$f":"+'HULP-velden'!AO211","v":26},{"$f":"+'HULP-velden'!AP211","v":36}]
[null,null,null,null,null,null,null,{"$f":"'HULP-velden'!AE212","v":311000},null,{"$f":"+'HULP-velden'!AJ212","v":-24.5},{"$f":"+'HULP-velden'!AK212","v":-14.499999999999998},{"$f":"+'HULP-velden'!AL212","v":-4.5},{"$f":"+'HULP-velden'!AM212","v":5.5},{"$f":"+'HULP-velden'!AN212","v":15.5},{"$f":"+'HULP-velden'!AO212","v":25.5},{"$f":"+'HULP-velden'!AP212","v":35.5}]
[null,null,null,null,null,null,null,{"$f":"'HULP-velden'!AE213","v":310000},null,{"$f":"+'HULP-velden'!AJ213","v":-25},{"$f":"+'HULP-velden'!AK213","v":-15},{"$f":"+'HULP-velden'!AL213","v":-5},{"$f":"+'HULP-velden'!AM213","v":5},{"$f":"+'HULP-velden'!AN213","v":15},{"$f":"+'HULP-velden'!AO213","v":25},{"$f":"+'HULP-velden'!AP213","v":35}]
[null,null,null,null,null,null,null,{"$f":"'HULP-velden'!AE214","v":309000},null,{"$f":"+'HULP-velden'!AJ214","v":-25.5},{"$f":"+'HULP-velden'!AK214","v":-15.5},{"$f":"+'HULP-velden'!AL214","v":-5.5},{"$f":"+'HULP-velden'!AM214","v":4.5},{"$f":"+'HULP-velden'!AN214","v":14.499999999999998},{"$f":"+'HULP-velden'!AO214","v":24.5},{"$f":"+'HULP-velden'!AP214","v":34.5}]
[null,null,null,null,null,null,null,{"$f":"'HULP-velden'!AE215","v":308000},null,{"$f":"+'HULP-velden'!AJ215","v":-26},{"$f":"+'HULP-velden'!AK215","v":-16},{"$f":"+'HULP-velden'!AL215","v":-6},{"$f":"+'HULP-velden'!AM215","v":4},{"$f":"+'HULP-velden'!AN215","v":14.000000000000002},{"$f":"+'HULP-velden'!AO215","v":24},{"$f":"+'HULP-velden'!AP215","v":34}]
[null,null,null,null,null,null,null,{"$f":"'HULP-velden'!AE216","v":307000},null,{"$f":"+'HULP-velden'!AJ216","v":-26.5},{"$f":"+'HULP-velden'!AK216","v":-16.5},{"$f":"+'HULP-velden'!AL216","v":-6.5},{"$f":"+'HULP-velden'!AM216","v":3.5000000000000004},{"$f":"+'HULP-velden'!AN216","v":13.5},{"$f":"+'HULP-velden'!AO216","v":23.5},{"$f":"+'HULP-velden'!AP216","v":33.5}]
[null,null,null,null,null,null,null,{"$f":"'HULP-velden'!AE217","v":306000},null,{"$f":"+'HULP-velden'!AJ217","v":-27},{"$f":"+'HULP-velden'!AK217","v":-17},{"$f":"+'HULP-velden'!AL217","v":-7.0000000000000009},{"$f":"+'HULP-velden'!AM217","v":3},{"$f":"+'HULP-velden'!AN217","v":13},{"$f":"+'HULP-velden'!AO217","v":23},{"$f":"+'HULP-velden'!AP217","v":33}]
[null,null,null,null,null,null,null,{"$f":"'HULP-velden'!AE218","v":305000},null,{"$f":"+'HULP-velden'!AJ218","v":-27.500000000000004},{"$f":"+'HULP-velden'!AK218","v":-17.5},{"$f":"+'HULP-velden'!AL218","v":-7.5},{"$f":"+'HULP-velden'!AM218","v":2.5},{"$f":"+'HULP-velden'!AN218","v":12.5},{"$f":"+'HULP-velden'!AO218","v":22.5},{"$f":"+'HULP-velden'!AP218","v":32.5}]
[null,null,null,null,null,null,null,{"$f":"'HULP-velden'!AE219","v":304000},null,{"$f":"+'HULP-velden'!AJ219","v":-28.000000000000004},{"$f":"+'HULP-velden'!AK219","v":-18},{"$f":"+'HULP-velden'!AL219","v":-8},{"$f":"+'HULP-velden'!AM219","v":2},{"$f":"+'HULP-velden'!AN219","v":12},{"$f":"+'HULP-velden'!AO219","v":22},{"$f":"+'HULP-velden'!AP219","v":32}]
[null,null,null,null,null,null,null,{"$f":"'HULP-velden'!AE220","v":303000},null,{"$f":"+'HULP-velden'!AJ220","v":-28.499999999999996},{"$f":"+'HULP-velden'!AK220","v":-18.5},{"$f":"+'HULP-velden'!AL220","v":-8.5},{"$f":"+'HULP-velden'!AM220","v":1.5},{"$f":"+'HULP-velden'!AN220","v":11.5},{"$f":"+'HULP-velden'!AO220","v":21.5},{"$f":"+'HULP-velden'!AP220","v":31.5}]
[null,null,null,null,null,null,null,{"$f":"'HULP-velden'!AE221","v":302000},null,{"$f":"+'HULP-velden'!AJ221","v":-28.999999999999996},{"$f":"+'HULP-velden'!AK221","v":-19},{"$f":"+'HULP-velden'!AL221","v":-9},{"$f":"+'HULP-velden'!AM221","v":1},{"$f":"+'HULP-velden'!AN221","v":11},{"$f":"+'HULP-velden'!AO221","v":21},{"$f":"+'HULP-velden'!AP221","v":31}]
[null,null,null,null,null,null,null,{"$f":"'HULP-velden'!AE222","v":301000},null,{"$f":"+'HULP-velden'!AJ222","v":-29.5},{"$f":"+'HULP-velden'!AK222","v":-19.5},{"$f":"+'HULP-velden'!AL222","v":-9.5},{"$f":"+'HULP-velden'!AM222","v":0.5},{"$f":"+'HULP-velden'!AN222","v":10.5},{"$f":"+'HULP-velden'!AO222","v":20.5},{"$f":"+'HULP-velden'!AP222","v":30.5}]
[null,null,null,null,null,null,null,{"$f":"'HULP-velden'!AE223","v":300000},null,{"$f":"+'HULP-velden'!AJ223","v":-30},{"$f":"+'HULP-velden'!AK223","v":-20},{"$f":"+'HULP-velden'!AL223","v":-10},{"$f":"+'HULP-velden'!AM223","v":0},{"$f":"+'HULP-velden'!AN223","v":10},{"$f":"+'HULP-velden'!AO223","v":20},{"$f":"+'HULP-velden'!AP223","v":30}]

{"sheet":"DATA-hulp","index":10,"n_rows":208,"n_cols":16,"rows_kept":208,"cut":false,"hidden":true,"merged":[]}
[]
[null,"Uw Inschrijving",{"$f":"'BPK-Grafiek'!H8","v":0},"Qscore",{"$f":"'BPK-Grafiek'!H11","v":0},"Pscore",{"$f":"IF(C5=\"Machtsformule\",ROUND($C$10-$C$10*(((C2-$C$20)/($C$21-$C$20))^$C$23),1),ROUND(C10*((($C$21-C2)/($C$21-$C$20))^(1/$C$23)),1))","v":1250},"BPK-score",{"$f":"E2+G2","v":1250},"Qscore (norm)",{"$f":"E2/C6*100","v":0}]
[]
[null,"De hieronder opgenomen date is noodzakelijk voor de opbouw van de BPK-grafiek"]
[null,"Type formule",{"$f":"'HULP-velden'!E6","v":"Machtsformule"},null,null,null,null,"Y-as",null,"X-as"]
[null,"Qmax (x-as)",{"$f":"+C12","v":500},{"$f":"+C6","v":500},null,null,null,null,null,"BPK-Lijnen"]
[null,"Qmax (y-as)",0,{"$f":"+C25*2","v":800000},null,null,null,"Prijs",null,{"$f":"+'HULP-velden'!AJ16","v":"BPK-Lijn -3"},{"$f":"+'HULP-velden'!AK16","v":"BPK-Lijn -2"},{"$f":"+'HULP-velden'!AL16","v":"BPK-Lijn -1"},{"$f":"+'HULP-velden'!AM16","v":"BPK-lijn Ref"},{"$f":"+'HULP-velden'!AN16","v":"BPK-Lijn +1"},{"$f":"+'HULP-velden'!AO16","v":"BPK-Lijn +2"},{"$f":"+'HULP-velden'!AP16","v":"BPK-Lijn +3"}]
[null,"Plafondprijs (x-as)",0,{"$f":"+C12","v":500},null,null,null,{"$f":"'HULP-velden'!AE22","v":500000},null,{"$f":"+'HULP-velden'!AJ22","v":70},{"$f":"+'HULP-velden'!AK22","v":80},{"$f":"+'HULP-velden'!AL22","v":90},{"$f":"+'HULP-velden'!AM22","v":100},{"$f":"+'HULP-velden'!AN22","v":110.00000000000001},{"$f":"+'HULP-velden'!AO22","v":120},{"$f":"+'HULP-velden'!AP22","v":130}]
[null,"Plafondprijs (y-as)",{"$f":"+C19","v":-100000},{"$f":"+C19","v":-100000},null,null,null,{"$f":"'HULP-velden'!AE23","v":499000},null,{"$f":"+'HULP-velden'!AJ23","v":69.5},{"$f":"+'HULP-velden'!AK23","v":79.5},{"$f":"+'HULP-velden'!AL23","v":89.5},{"$f":"+'HULP-velden'!AM23","v":99.5},{"$f":"+'HULP-velden'!AN23","v":109.5},{"$f":"+'HULP-velden'!AO23","v":119.5},{"$f":"+'HULP-velden'!AP23","v":129.5}]
[null,"Punten voor Prijs",{"$f":"'HULP-velden'!H6","v":500},null,null,null,null,{"$f":"'HULP-velden'!AE24","v":498000},null,{"$f":"+'HULP-velden'!AJ24","v":69},{"$f":"+'HULP-velden'!AK24","v":79},{"$f":"+'HULP-velden'!AL24","v":89},{"$f":"+'HULP-velden'!AM24","v":99},{"$f":"+'HULP-velden'!AN24","v":109.00000000000001},{"$f":"+'HULP-velden'!AO24","v":119},{"$f":"+'HULP-velden'!AP24","v":129}]
[null,"Methode/Qref",{"$f":"'HULP-velden'!M15","v":250},{"$f":"'HULP-velden'!F7","v":0},null,null,null,{"$f":"'HULP-velden'!AE25","v":497000},null,{"$f":"+'HULP-velden'!AJ25","v":68.5},{"$f":"+'HULP-velden'!AK25","v":78.5},{"$f":"+'HULP-velden'!AL25","v":88.5},{"$f":"+'HULP-velden'!AM25","v":98.5},{"$f":"+'HULP-velden'!AN25","v":108.5},{"$f":"+'HULP-velden'!AO25","v":118.5},{"$f":"+'HULP-velden'!AP25","v":128.5}]
[null,"Qwensen",{"$f":"'HULP-velden'!C6","v":500},null,null,null,null,{"$f":"'HULP-velden'!AE26","v":496000},null,{"$f":"+'HULP-velden'!AJ26","v":68},{"$f":"+'HULP-velden'!AK26","v":78},{"$f":"+'HULP-velden'!AL26","v":88},{"$f":"+'HULP-velden'!AM26","v":98},{"$f":"+'HULP-velden'!AN26","v":108},{"$f":"+'HULP-velden'!AO26","v":118},{"$f":"+'HULP-velden'!AP26","v":128}]
[null,"Stappen",{"$f":"+'HULP-velden'!C7","v":25},null,null,null,null,{"$f":"'HULP-velden'!AE27","v":495000},null,{"$f":"+'HULP-velden'!AJ27","v":67.5},{"$f":"+'HULP-velden'!AK27","v":77.5},{"$f":"+'HULP-velden'!AL27","v":87.5},{"$f":"+'HULP-velden'!AM27","v":97.5},{"$f":"+'HULP-velden'!AN27","v":107.5},{"$f":"+'HULP-velden'!AO27","v":117.5},{"$f":"+'HULP-velden'!AP27","v":127.49999999999999}]
[null,null,null,null,null,null,null,{"$f":"'HULP-velden'!AE28","v":494000},null,{"$f":"+'HULP-velden'!AJ28","v":67},{"$f":"+'HULP-velden'!AK28","v":77},{"$f":"+'HULP-velden'!AL28","v":87},{"$f":"+'HULP-velden'!AM28","v":97},{"$f":"+'HULP-velden'!AN28","v":107},{"$f":"+'HULP-velden'!AO28","v":117},{"$f":"+'HULP-velden'!AP28","v":127}]
[null,"Q-score voorbeeld inschrijvig",{"$f":"'HULP-velden'!F12","v":50},null,null,null,null,{"$f":"'HULP-velden'!AE29","v":493000},null,{"$f":"+'HULP-velden'!AJ29","v":66.5},{"$f":"+'HULP-velden'!AK29","v":76.5},{"$f":"+'HULP-velden'!AL29","v":86.5},{"$f":"+'HULP-velden'!AM29","v":96.5},{"$f":"+'HULP-velden'!AN29","v":106.5},{"$f":"+'HULP-velden'!AO29","v":116.5},{"$f":"+'HULP-velden'!AP29","v":126.49999999999999}]
[null,"Wq",{"$f":"+'HULP-velden'!C10","v":0.5},{"$f":"+D6","v":500},null,null,null,{"$f":"'HULP-velden'!AE30","v":492000},null,{"$f":"+'HULP-velden'!AJ30","v":66},{"$f":"+'HULP-velden'!AK30","v":76},{"$f":"+'HULP-velden'!AL30","v":86},{"$f":"+'HULP-velden'!AM30","v":96},{"$f":"+'HULP-velden'!AN30","v":106},{"$f":"+'HULP-velden'!AO30","v":115.99999999999999},{"$f":"+'HULP-velden'!AP30","v":126}]
[null,"Wp",{"$f":"+'HULP-velden'!C11","v":0.5},{"$f":"D16/C16*C17","v":500},null,null,null,{"$f":"'HULP-velden'!AE31","v":491000},null,{"$f":"+'HULP-velden'!AJ31","v":65.5},{"$f":"+'HULP-velden'!AK31","v":75.5},{"$f":"+'HULP-velden'!AL31","v":85.5},{"$f":"+'HULP-velden'!AM31","v":95.5},{"$f":"+'HULP-velden'!AN31","v":105.5},{"$f":"+'HULP-velden'!AO31","v":115.5},{"$f":"+'HULP-velden'!AP31","v":125.49999999999999}]
[null,null,null,null,null,null,null,{"$f":"'HULP-velden'!AE32","v":490000},null,{"$f":"+'HULP-velden'!AJ32","v":65},{"$f":"+'HULP-velden'!AK32","v":75},{"$f":"+'HULP-velden'!AL32","v":85},{"$f":"+'HULP-velden'!AM32","v":95},{"$f":"+'HULP-velden'!AN32","v":105},{"$f":"+'HULP-velden'!AO32","v":114.99999999999999},{"$f":"+'HULP-velden'!AP32","v":125}]
[null,"Plafondprijs",{"$f":"+'HULP-velden'!C13","v":-100000},null,null,null,null,{"$f":"'HULP-velden'!AE33","v":489000},null,{"$f":"+'HULP-velden'!AJ33","v":64.5},{"$f":"+'HULP-velden'!AK33","v":74.5},{"$f":"+'HULP-velden'!AL33","v":84.5},{"$f":"+'HULP-velden'!AM33","v":94.5},{"$f":"+'HULP-velden'!AN33","v":104.5},{"$f":"+'HULP-velden'!AO33","v":114.5},{"$f":"+'HULP-velden'!AP33","v":124.50000000000001}]
[null,"Ondergrens",{"$f":"+'HULP-velden'!C14","v":300000},{"$f":"+C20","v":300000},null,null,null,{"$f":"'HULP-velden'!AE34","v":488000},null,{"$f":"+'HULP-velden'!AJ34","v":64},{"$f":"+'HULP-velden'!AK34","v":74},{"$f":"+'HULP-velden'!AL34","v":84},{"$f":"+'HULP-velden'!AM34","v":94},{"$f":"+'HULP-velden'!AN34","v":104},{"$f":"+'HULP-velden'!AO34","v":113.99999999999999},{"$f":"+'HULP-velden'!AP34","v":124}]
[null,"Bovengrens",{"$f":"+'HULP-velden'!C17","v":500000},{"$f":"+C21","v":500000},null,null,null,{"$f":"'HULP-velden'!AE35","v":487000},null,{"$f":"+'HULP-velden'!AJ35","v":63.5},{"$f":"+'HULP-velden'!AK35","v":73.5},{"$f":"+'HULP-velden'!AL35","v":83.5},{"$f":"+'HULP-velden'!AM35","v":93.5},{"$f":"+'HULP-velden'!AN35","v":103.49999999999999},{"$f":"+'HULP-velden'!AO35","v":113.5},{"$f":"+'HULP-velden'!AP35","v":123.50000000000001}]
[null,"LAQ",{"$f":"+'HULP-velden'!C15","v":-1000},{"$f":"Dashboard!H22","v":0},null,null,null,{"$f":"'HULP-velden'!AE36","v":486000},null,{"$f":"+'HULP-velden'!AJ36","v":63},{"$f":"+'HULP-velden'!AK36","v":73},{"$f":"+'HULP-velden'!AL36","v":83},{"$f":"+'HULP-velden'!AM36","v":93},{"$f":"+'HULP-velden'!AN36","v":103},{"$f":"+'HULP-velden'!AO36","v":112.99999999999999},{"$f":"+'HULP-velden'!AP36","v":123}]
[null,"n-factor",{"$f":"Dashboard!H16","v":1},null,null,null,null,{"$f":"'HULP-velden'!AE37","v":485000},null,{"$f":"+'HULP-velden'!AJ37","v":62.5},{"$f":"+'HULP-velden'!AK37","v":72.5},{"$f":"+'HULP-velden'!AL37","v":82.5},{"$f":"+'HULP-velden'!AM37","v":92.5},{"$f":"+'HULP-velden'!AN37","v":102.49999999999999},{"$f":"+'HULP-velden'!AO37","v":112.5},{"$f":"+'HULP-velden'!AP37","v":122.50000000000001}]
[null,null,null,null,null,null,null,{"$f":"'HULP-velden'!AE38","v":484000},null,{"$f":"+'HULP-velden'!AJ38","v":62},{"$f":"+'HULP-velden'!AK38","v":72},{"$f":"+'HULP-velden'!AL38","v":82},{"$f":"+'HULP-velden'!AM38","v":92},{"$f":"+'HULP-velden'!AN38","v":102},{"$f":"+'HULP-velden'!AO38","v":112.00000000000001},{"$f":"+'HULP-velden'!AP38","v":122}]
[null,"Prijs voorbeeld inschrijving",{"$f":"+'HULP-velden'!C8","v":400000},null,null,null,null,{"$f":"'HULP-velden'!AE39","v":483000},null,{"$f":"+'HULP-velden'!AJ39","v":61.5},{"$f":"+'HULP-velden'!AK39","v":71.5},{"$f":"+'HULP-velden'!AL39","v":81.5},{"$f":"+'HULP-velden'!AM39","v":91.5},{"$f":"+'HULP-velden'!AN39","v":101.49999999999999},{"$f":"+'HULP-velden'!AO39","v":111.5},{"$f":"+'HULP-velden'!AP39","v":121.50000000000001}]
[null,"Score kwaliteit voorbeeld inschrijving",{"$f":"'HULP-velden'!C165","v":250},null,null,null,null,{"$f":"'HULP-velden'!AE40","v":482000},null,{"$f":"+'HULP-velden'!AJ40","v":61},{"$f":"+'HULP-velden'!AK40","v":71},{"$f":"+'HULP-velden'!AL40","v":81},{"$f":"+'HULP-velden'!AM40","v":91},{"$f":"+'HULP-velden'!AN40","v":101},{"$f":"+'HULP-velden'!AO40","v":111.00000000000001},{"$f":"+'HULP-velden'!AP40","v":121}]
[null,"Score prijs voorbeeld inschrijving",{"$f":"'HULP-velden'!C164","v":250},null,null,null,null,{"$f":"'HULP-velden'!AE41","v":481000},null,{"$f":"+'HULP-velden'!AJ41","v":60.5},{"$f":"+'HULP-velden'!AK41","v":70.5},{"$f":"+'HULP-velden'!AL41","v":80.5},{"$f":"+'HULP-velden'!AM41","v":90.5},{"$f":"+'HULP-velden'!AN41","v":100.49999999999999},{"$f":"+'HULP-velden'!AO41","v":110.5},{"$f":"+'HULP-velden'!AP41","v":120.5}]
[null,"BPK-Score voorbeeld",{"$f":"'HULP-velden'!C163","v":500},null,null,null,null,{"$f":"'HULP-velden'!AE42","v":480000},null,{"$f":"+'HULP-velden'!AJ42","v":60},{"$f":"+'HULP-velden'!AK42","v":70},{"$f":"+'HULP-velden'!AL42","v":80},{"$f":"+'HULP-velden'!AM42","v":90},{"$f":"+'HULP-velden'!AN42","v":100},{"$f":"+'HULP-velden'!AO42","v":110.00000000000001},{"$f":"+'HULP-velden'!AP42","v":120}]
[null,null,null,null,null,null,null,{"$f":"'HULP-velden'!AE43","v":479000},null,{"$f":"+'HULP-velden'!AJ43","v":59.5},{"$f":"+'HULP-velden'!AK43","v":69.5},{"$f":"+'HULP-velden'!AL43","v":79.5},{"$f":"+'HULP-velden'!AM43","v":89.5},{"$f":"+'HULP-velden'!AN43","v":99.5},{"$f":"+'HULP-velden'!AO43","v":109.5},{"$f":"+'HULP-velden'!AP43","v":119.5}]
[null,null,null,null,null,null,null,{"$f":"'HULP-velden'!AE44","v":478000},null,{"$f":"+'HULP-velden'!AJ44","v":59},{"$f":"+'HULP-velden'!AK44","v":69},{"$f":"+'HULP-velden'!AL44","v":79},{"$f":"+'HULP-velden'!AM44","v":89},{"$f":"+'HULP-velden'!AN44","v":99},{"$f":"+'HULP-velden'!AO44","v":109.00000000000001},{"$f":"+'HULP-velden'!AP44","v":119}]
[null,null,null,null,null,null,null,{"$f":"'HULP-velden'!AE45","v":477000},null,{"$f":"+'HULP-velden'!AJ45","v":58.5},{"$f":"+'HULP-velden'!AK45","v":68.5},{"$f":"+'HULP-velden'!AL45","v":78.5},{"$f":"+'HULP-velden'!AM45","v":88.5},{"$f":"+'HULP-velden'!AN45","v":98.5},{"$f":"+'HULP-velden'!AO45","v":108.5},{"$f":"+'HULP-velden'!AP45","v":118.5}]
[null,null,null,null,null,null,null,{"$f":"'HULP-velden'!AE46","v":476000},null,{"$f":"+'HULP-velden'!AJ46","v":57.999999999999993},{"$f":"+'HULP-velden'!AK46","v":68},{"$f":"+'HULP-velden'!AL46","v":78},{"$f":"+'HULP-velden'!AM46","v":88},{"$f":"+'HULP-velden'!AN46","v":98},{"$f":"+'HULP-velden'!AO46","v":108},{"$f":"+'HULP-velden'!AP46","v":118}]
[null,null,null,null,null,null,null,{"$f":"'HULP-velden'!AE47","v":475000},null,{"$f":"+'HULP-velden'!AJ47","v":57.499999999999993},{"$f":"+'HULP-velden'!AK47","v":67.5},{"$f":"+'HULP-velden'!AL47","v":77.5},{"$f":"+'HULP-velden'!AM47","v":87.5},{"$f":"+'HULP-velden'!AN47","v":97.5},{"$f":"+'HULP-velden'!AO47","v":107.5},{"$f":"+'HULP-velden'!AP47","v":117.5}]
[null,"Naam",{"$f":"Dashboard!E6","v":" "},null,null,null,null,{"$f":"'HULP-velden'!AE48","v":474000},null,{"$f":"+'HULP-velden'!AJ48","v":56.999999999999993},{"$f":"+'HULP-velden'!AK48","v":67},{"$f":"+'HULP-velden'!AL48","v":77},{"$f":"+'HULP-velden'!AM48","v":87},{"$f":"+'HULP-velden'!AN48","v":97},{"$f":"+'HULP-velden'!AO48","v":107},{"$f":"+'HULP-velden'!AP48","v":117}]
[null,"Kenmerk",{"$f":"Dashboard!E7","v":" "},null,null,null,null,{"$f":"'HULP-velden'!AE49","v":473000},null,{"$f":"+'HULP-velden'!AJ49","v":56.499999999999993},{"$f":"+'HULP-velden'!AK49","v":66.5},{"$f":"+'HULP-velden'!AL49","v":76.5},{"$f":"+'HULP-velden'!AM49","v":86.5},{"$f":"+'HULP-velden'!AN49","v":96.5},{"$f":"+'HULP-velden'!AO49","v":106.5},{"$f":"+'HULP-velden'!AP49","v":116.5}]
[null,null,null,null,null,null,null,{"$f":"'HULP-velden'!AE50","v":472000},null,{"$f":"+'HULP-velden'!AJ50","v":56.000000000000007},{"$f":"+'HULP-velden'!AK50","v":66},{"$f":"+'HULP-velden'!AL50","v":76},{"$f":"+'HULP-velden'!AM50","v":86},{"$f":"+'HULP-velden'!AN50","v":96},{"$f":"+'HULP-velden'!AO50","v":106},{"$f":"+'HULP-velden'!AP50","v":115.99999999999999}]
[null,null,null,null,null,null,null,{"$f":"'HULP-velden'!AE51","v":471000},null,{"$f":"+'HULP-velden'!AJ51","v":55.500000000000007},{"$f":"+'HULP-velden'!AK51","v":65.5},{"$f":"+'HULP-velden'!AL51","v":75.5},{"$f":"+'HULP-velden'!AM51","v":85.5},{"$f":"+'HULP-velden'!AN51","v":95.5},{"$f":"+'HULP-velden'!AO51","v":105.5},{"$f":"+'HULP-velden'!AP51","v":115.5}]
[null,"Ten behoeve van grafiek",null,null,null,null,null,{"$f":"'HULP-velden'!AE52","v":470000},null,{"$f":"+'HULP-velden'!AJ52","v":55.000000000000007},{"$f":"+'HULP-velden'!AK52","v":65},{"$f":"+'HULP-velden'!AL52","v":75},{"$f":"+'HULP-velden'!AM52","v":85},{"$f":"+'HULP-velden'!AN52","v":95},{"$f":"+'HULP-velden'!AO52","v":105},{"$f":"+'HULP-velden'!AP52","v":114.99999999999999}]
[null,"Onder-lijn (x-as)",null,{"$f":"'HULP-velden'!D104","v":280000},null,null,null,{"$f":"'HULP-velden'!AE53","v":469000},null,{"$f":"+'HULP-velden'!AJ53","v":54.500000000000007},{"$f":"+'HULP-velden'!AK53","v":64.5},{"$f":"+'HULP-velden'!AL53","v":74.5},{"$f":"+'HULP-velden'!AM53","v":84.5},{"$f":"+'HULP-velden'!AN53","v":94.5},{"$f":"+'HULP-velden'!AO53","v":104.5},{"$f":"+'HULP-velden'!AP53","v":114.5}]
[null,"Qmax",{"$f":"+'HULP-velden'!C20","v":100},{"$f":"+'HULP-velden'!D20","v":100},null,null,null,{"$f":"'HULP-velden'!AE54","v":468000},null,{"$f":"+'HULP-velden'!AJ54","v":54},{"$f":"+'HULP-velden'!AK54","v":64},{"$f":"+'HULP-velden'!AL54","v":74},{"$f":"+'HULP-velden'!AM54","v":84},{"$f":"+'HULP-velden'!AN54","v":94},{"$f":"+'HULP-velden'!AO54","v":104},{"$f":"+'HULP-velden'!AP54","v":113.99999999999999}]
[null,"Bovenlijn",{"$f":"+'HULP-velden'!C21","v":0},{"$f":"+'HULP-velden'!D21","v":520000},null,null,null,{"$f":"'HULP-velden'!AE55","v":467000},null,{"$f":"+'HULP-velden'!AJ55","v":53.5},{"$f":"+'HULP-velden'!AK55","v":63.5},{"$f":"+'HULP-velden'!AL55","v":73.5},{"$f":"+'HULP-velden'!AM55","v":83.5},{"$f":"+'HULP-velden'!AN55","v":93.5},{"$f":"+'HULP-velden'!AO55","v":103.49999999999999},{"$f":"+'HULP-velden'!AP55","v":113.5}]
[null,"Referentie",{"$f":"'HULP-velden'!M15","v":250},{"$f":"+'HULP-velden'!M14","v":400000},null,null,null,{"$f":"'HULP-velden'!AE56","v":466000},null,{"$f":"+'HULP-velden'!AJ56","v":53},{"$f":"+'HULP-velden'!AK56","v":63},{"$f":"+'HULP-velden'!AL56","v":73},{"$f":"+'HULP-velden'!AM56","v":83},{"$f":"+'HULP-velden'!AN56","v":93},{"$f":"+'HULP-velden'!AO56","v":103},{"$f":"+'HULP-velden'!AP56","v":112.99999999999999}]
[null,"Qknockout Prijs",{"$f":"'HULP-velden'!C23","v":0},{"$f":"'HULP-velden'!D23","v":100},null,null,null,{"$f":"'HULP-velden'!AE57","v":465000},null,{"$f":"+'HULP-velden'!AJ57","v":52.5},{"$f":"+'HULP-velden'!AK57","v":62.5},{"$f":"+'HULP-velden'!AL57","v":72.5},{"$f":"+'HULP-velden'!AM57","v":82.5},{"$f":"+'HULP-velden'!AN57","v":92.5},{"$f":"+'HULP-velden'!AO57","v":102.49999999999999},{"$f":"+'HULP-velden'!AP57","v":112.5}]
[null,null,{"$f":"+'HULP-velden'!C13","v":-100000},{"$f":"+C44","v":-100000},null,null,null,{"$f":"'HULP-velden'!AE58","v":464000},null,{"$f":"+'HULP-velden'!AJ58","v":52},{"$f":"+'HULP-velden'!AK58","v":62},{"$f":"+'HULP-velden'!AL58","v":72},{"$f":"+'HULP-velden'!AM58","v":82},{"$f":"+'HULP-velden'!AN58","v":92},{"$f":"+'HULP-velden'!AO58","v":102},{"$f":"+'HULP-velden'!AP58","v":112.00000000000001}]
[null,"Vergelijkingswaarde x 1.000",0,{"$f":"+'HULP-velden'!D21","v":520000},null,null,null,{"$f":"'HULP-velden'!AE59","v":463000},null,{"$f":"+'HULP-velden'!AJ59","v":51.5},{"$f":"+'HULP-velden'!AK59","v":61.5},{"$f":"+'HULP-velden'!AL59","v":71.5},{"$f":"+'HULP-velden'!AM59","v":81.5},{"$f":"+'HULP-velden'!AN59","v":91.5},{"$f":"+'HULP-velden'!AO59","v":101.49999999999999},{"$f":"+'HULP-velden'!AP59","v":111.5}]
[null,"Qkncokout Kwaliteit",{"$f":"'HULP-velden'!C26","v":-1000},{"$f":"'HULP-velden'!D26","v":-1000},null,null,null,{"$f":"'HULP-velden'!AE60","v":462000},null,{"$f":"+'HULP-velden'!AJ60","v":51},{"$f":"+'HULP-velden'!AK60","v":61},{"$f":"+'HULP-velden'!AL60","v":71},{"$f":"+'HULP-velden'!AM60","v":81},{"$f":"+'HULP-velden'!AN60","v":91},{"$f":"+'HULP-velden'!AO60","v":101},{"$f":"+'HULP-velden'!AP60","v":111.00000000000001}]
[null,"Qmin",{"$f":"'HULP-velden'!C28","v":0},{"$f":"'HULP-velden'!D28","v":0},null,null,null,{"$f":"'HULP-velden'!AE61","v":461000},null,{"$f":"+'HULP-velden'!AJ61","v":50.5},{"$f":"+'HULP-velden'!AK61","v":60.5},{"$f":"+'HULP-velden'!AL61","v":70.5},{"$f":"+'HULP-velden'!AM61","v":80.5},{"$f":"+'HULP-velden'!AN61","v":90.5},{"$f":"+'HULP-velden'!AO61","v":100.49999999999999},{"$f":"+'HULP-velden'!AP61","v":110.5}]
[null,"Punten bij Qmin",{"$f":"+C47","v":0},0,null,null,null,{"$f":"'HULP-velden'!AE62","v":460000},null,{"$f":"+'HULP-velden'!AJ62","v":50},{"$f":"+'HULP-velden'!AK62","v":60},{"$f":"+'HULP-velden'!AL62","v":70},{"$f":"+'HULP-velden'!AM62","v":80},{"$f":"+'HULP-velden'!AN62","v":90},{"$f":"+'HULP-velden'!AO62","v":100},{"$f":"+'HULP-velden'!AP62","v":110.00000000000001}]
[null,"Punten Bij Qmax",{"$f":"C12","v":500},0,null,null,null,{"$f":"'HULP-velden'!AE63","v":459000},null,{"$f":"+'HULP-velden'!AJ63","v":49.5},{"$f":"+'HULP-velden'!AK63","v":59.5},{"$f":"+'HULP-velden'!AL63","v":69.5},{"$f":"+'HULP-velden'!AM63","v":79.5},{"$f":"+'HULP-velden'!AN63","v":89.5},{"$f":"+'HULP-velden'!AO63","v":99.5},{"$f":"+'HULP-velden'!AP63","v":109.5}]
[null,"Waarde bij Qmin",{"$f":"'HULP-velden'!C29","v":0},null,null,null,null,{"$f":"'HULP-velden'!AE64","v":458000},null,{"$f":"+'HULP-velden'!AJ64","v":49},{"$f":"+'HULP-velden'!AK64","v":59},{"$f":"+'HULP-velden'!AL64","v":69},{"$f":"+'HULP-velden'!AM64","v":79},{"$f":"+'HULP-velden'!AN64","v":89},{"$f":"+'HULP-velden'!AO64","v":99},{"$f":"+'HULP-velden'!AP64","v":109.00000000000001}]
[null,"Waarde bij Qmax",{"$f":"'HULP-velden'!C30","v":500},null,null,null,null,{"$f":"'HULP-velden'!AE65","v":457000},null,{"$f":"+'HULP-velden'!AJ65","v":48.5},{"$f":"+'HULP-velden'!AK65","v":58.5},{"$f":"+'HULP-velden'!AL65","v":68.5},{"$f":"+'HULP-velden'!AM65","v":78.5},{"$f":"+'HULP-velden'!AN65","v":88.5},{"$f":"+'HULP-velden'!AO65","v":98.5},{"$f":"+'HULP-velden'!AP65","v":108.5}]
[null,"LAQ",{"$f":"'HULP-velden'!C26","v":-1000},{"$f":"'HULP-velden'!D26","v":-1000},null,null,null,{"$f":"'HULP-velden'!AE66","v":456000},null,{"$f":"+'HULP-velden'!AJ66","v":48},{"$f":"+'HULP-velden'!AK66","v":57.999999999999993},{"$f":"+'HULP-velden'!AL66","v":68},{"$f":"+'HULP-velden'!AM66","v":78},{"$f":"+'HULP-velden'!AN66","v":88},{"$f":"+'HULP-velden'!AO66","v":98},{"$f":"+'HULP-velden'!AP66","v":108}]
[null,"Tekst",{"$f":"'HULP-velden'!G15","v":"LAQ = "},null,null,null,null,{"$f":"'HULP-velden'!AE67","v":455000},null,{"$f":"+'HULP-velden'!AJ67","v":47.5},{"$f":"+'HULP-velden'!AK67","v":57.499999999999993},{"$f":"+'HULP-velden'!AL67","v":67.5},{"$f":"+'HULP-velden'!AM67","v":77.5},{"$f":"+'HULP-velden'!AN67","v":87.5},{"$f":"+'HULP-velden'!AO67","v":97.5},{"$f":"+'HULP-velden'!AP67","v":107.5}]
[null,"Plafondprijs",{"$f":"'HULP-velden'!C13","v":-100000},{"$f":"+C54","v":-100000},null,null,null,{"$f":"'HULP-velden'!AE68","v":454000},null,{"$f":"+'HULP-velden'!AJ68","v":47},{"$f":"+'HULP-velden'!AK68","v":56.999999999999993},{"$f":"+'HULP-velden'!AL68","v":67},{"$f":"+'HULP-velden'!AM68","v":77},{"$f":"+'HULP-velden'!AN68","v":87},{"$f":"+'HULP-velden'!AO68","v":97},{"$f":"+'HULP-velden'!AP68","v":107}]
[null,"Tekst",{"$f":"'HULP-velden'!G16","v":"Plafondprijs; -€ 100"},null,null,null,null,{"$f":"'HULP-velden'!AE69","v":453000},null,{"$f":"+'HULP-velden'!AJ69","v":46.5},{"$f":"+'HULP-velden'!AK69","v":56.499999999999993},{"$f":"+'HULP-velden'!AL69","v":66.5},{"$f":"+'HULP-velden'!AM69","v":76.5},{"$f":"+'HULP-velden'!AN69","v":86.5},{"$f":"+'HULP-velden'!AO69","v":96.5},{"$f":"+'HULP-velden'!AP69","v":106.5}]
[null,null,null,null,null,null,null,{"$f":"'HULP-velden'!AE70","v":452000},null,{"$f":"+'HULP-velden'!AJ70","v":46},{"$f":"+'HULP-velden'!AK70","v":56.000000000000007},{"$f":"+'HULP-velden'!AL70","v":66},{"$f":"+'HULP-velden'!AM70","v":76},{"$f":"+'HULP-velden'!AN70","v":86},{"$f":"+'HULP-velden'!AO70","v":96},{"$f":"+'HULP-velden'!AP70","v":106}]
[null,null,null,null,null,null,null,{"$f":"'HULP-velden'!AE71","v":451000},null,{"$f":"+'HULP-velden'!AJ71","v":45.5},{"$f":"+'HULP-velden'!AK71","v":55.500000000000007},{"$f":"+'HULP-velden'!AL71","v":65.5},{"$f":"+'HULP-velden'!AM71","v":75.5},{"$f":"+'HULP-velden'!AN71","v":85.5},{"$f":"+'HULP-velden'!AO71","v":95.5},{"$f":"+'HULP-velden'!AP71","v":105.5}]
[null,null,null,null,null,null,null,{"$f":"'HULP-velden'!AE72","v":450000},null,{"$f":"+'HULP-velden'!AJ72","v":45},{"$f":"+'HULP-velden'!AK72","v":55.000000000000007},{"$f":"+'HULP-velden'!AL72","v":65},{"$f":"+'HULP-velden'!AM72","v":75},{"$f":"+'HULP-velden'!AN72","v":85},{"$f":"+'HULP-velden'!AO72","v":95},{"$f":"+'HULP-velden'!AP72","v":105}]
[null,"Ten behoeve van de grafiek Evaluatie",null,null,null,null,null,{"$f":"'HULP-velden'!AE73","v":449000},null,{"$f":"+'HULP-velden'!AJ73","v":44.5},{"$f":"+'HULP-velden'!AK73","v":54.500000000000007},{"$f":"+'HULP-velden'!AL73","v":64.5},{"$f":"+'HULP-velden'!AM73","v":74.5},{"$f":"+'HULP-velden'!AN73","v":84.5},{"$f":"+'HULP-velden'!AO73","v":94.5},{"$f":"+'HULP-velden'!AP73","v":104.5}]
[null,null,"Vergelijkingswaarde","Q-score","in %","Score","Rang",{"$f":"'HULP-velden'!AE74","v":448000},null,{"$f":"+'HULP-velden'!AJ74","v":44},{"$f":"+'HULP-velden'!AK74","v":54},{"$f":"+'HULP-velden'!AL74","v":64},{"$f":"+'HULP-velden'!AM74","v":74},{"$f":"+'HULP-velden'!AN74","v":84},{"$f":"+'HULP-velden'!AO74","v":94},{"$f":"+'HULP-velden'!AP74","v":104}]
[null,{"$f":"'HULP-velden'!D51","v":""},{"$f":"'HULP-velden'!E51","v":""},{"$f":"'HULP-velden'!F51","v":""},{"$f":"IF(D61=\"\",\"\",D61/$C$12*100)","v":""},{"$f":"IF(D61=\"\",\"\",'HULP-velden'!H51)","v":""},{"$f":"IF(D61=\"\",\"\",'HULP-velden'!K51)","v":""},{"$f":"'HULP-velden'!AE75","v":447000},null,{"$f":"+'HULP-velden'!AJ75","v":43.5},{"$f":"+'HULP-velden'!AK75","v":53.5},{"$f":"+'HULP-velden'!AL75","v":63.5},{"$f":"+'HULP-velden'!AM75","v":73.5},{"$f":"+'HULP-velden'!AN75","v":83.5},{"$f":"+'HULP-velden'!AO75","v":93.5},{"$f":"+'HULP-velden'!AP75","v":103.49999999999999}]
[null,{"$f":"'HULP-velden'!D52","v":""},{"$f":"'HULP-velden'!E52","v":""},{"$f":"'HULP-velden'!F52","v":""},{"$f":"IF(D62=\"\",\"\",D62/$C$12*100)","v":""},{"$f":"IF(D62=\"\",\"\",'HULP-velden'!H52)","v":""},{"$f":"IF(D62=\"\",\"\",'HULP-velden'!K52)","v":""},{"$f":"'HULP-velden'!AE76","v":446000},null,{"$f":"+'HULP-velden'!AJ76","v":43},{"$f":"+'HULP-velden'!AK76","v":53},{"$f":"+'HULP-velden'!AL76","v":63},{"$f":"+'HULP-velden'!AM76","v":73},{"$f":"+'HULP-velden'!AN76","v":83},{"$f":"+'HULP-velden'!AO76","v":93},{"$f":"+'HULP-velden'!AP76","v":103}]
[null,{"$f":"'HULP-velden'!D53","v":""},{"$f":"'HULP-velden'!E53","v":""},{"$f":"'HULP-velden'!F53","v":""},{"$f":"IF(D63=\"\",\"\",D63/$C$12*100)","v":""},{"$f":"IF(D63=\"\",\"\",'HULP-velden'!H53)","v":""},{"$f":"IF(D63=\"\",\"\",'HULP-velden'!K53)","v":""},{"$f":"'HULP-velden'!AE77","v":445000},null,{"$f":"+'HULP-velden'!AJ77","v":42.5},{"$f":"+'HULP-velden'!AK77","v":52.5},{"$f":"+'HULP-velden'!AL77","v":62.5},{"$f":"+'HULP-velden'!AM77","v":72.5},{"$f":"+'HULP-velden'!AN77","v":82.5},{"$f":"+'HULP-velden'!AO77","v":92.5},{"$f":"+'HULP-velden'!AP77","v":102.49999999999999}]
[null,{"$f":"'HULP-velden'!D54","v":""},{"$f":"'HULP-velden'!E54","v":""},{"$f":"'HULP-velden'!F54","v":""},"",{"$f":"IF(D64=\"\",\"\",'HULP-velden'!H54)","v":""},{"$f":"IF(D64=\"\",\"\",'HULP-velden'!K54)","v":""},{"$f":"'HULP-velden'!AE78","v":444000},null,{"$f":"+'HULP-velden'!AJ78","v":42},{"$f":"+'HULP-velden'!AK78","v":52},{"$f":"+'HULP-velden'!AL78","v":62},{"$f":"+'HULP-velden'!AM78","v":72},{"$f":"+'HULP-velden'!AN78","v":82},{"$f":"+'HULP-velden'!AO78","v":92},{"$f":"+'HULP-velden'!AP78","v":102}]
[null,{"$f":"'HULP-velden'!D55","v":""},{"$f":"'HULP-velden'!E55","v":""},{"$f":"'HULP-velden'!F55","v":""},"",{"$f":"IF(D65=\"\",\"\",'HULP-velden'!H55)","v":""},{"$f":"IF(D65=\"\",\"\",'HULP-velden'!K55)","v":""},{"$f":"'HULP-velden'!AE79","v":443000},null,{"$f":"+'HULP-velden'!AJ79","v":41.5},{"$f":"+'HULP-velden'!AK79","v":51.5},{"$f":"+'HULP-velden'!AL79","v":61.5},{"$f":"+'HULP-velden'!AM79","v":71.5},{"$f":"+'HULP-velden'!AN79","v":81.5},{"$f":"+'HULP-velden'!AO79","v":91.5},{"$f":"+'HULP-velden'!AP79","v":101.49999999999999}]
[null,{"$f":"'HULP-velden'!D56","v":""},{"$f":"'HULP-velden'!E56","v":""},{"$f":"'HULP-velden'!F56","v":""},"",{"$f":"IF(D66=\"\",\"\",'HULP-velden'!H56)","v":""},{"$f":"IF(D66=\"\",\"\",'HULP-velden'!K56)","v":""},{"$f":"'HULP-velden'!AE80","v":442000},null,{"$f":"+'HULP-velden'!AJ80","v":41},{"$f":"+'HULP-velden'!AK80","v":51},{"$f":"+'HULP-velden'!AL80","v":61},{"$f":"+'HULP-velden'!AM80","v":71},{"$f":"+'HULP-velden'!AN80","v":81},{"$f":"+'HULP-velden'!AO80","v":91},{"$f":"+'HULP-velden'!AP80","v":101}]
[null,{"$f":"'HULP-velden'!D57","v":""},{"$f":"'HULP-velden'!E57","v":""},{"$f":"'HULP-velden'!F57","v":""},"",{"$f":"IF(D67=\"\",\"\",'HULP-velden'!H57)","v":""},{"$f":"IF(D67=\"\",\"\",'HULP-velden'!K57)","v":""},{"$f":"'HULP-velden'!AE81","v":441000},null,{"$f":"+'HULP-velden'!AJ81","v":40.5},{"$f":"+'HULP-velden'!AK81","v":50.5},{"$f":"+'HULP-velden'!AL81","v":60.5},{"$f":"+'HULP-velden'!AM81","v":70.5},{"$f":"+'HULP-velden'!AN81","v":80.5},{"$f":"+'HULP-velden'!AO81","v":90.5},{"$f":"+'HULP-velden'!AP81","v":100.49999999999999}]
[null,{"$f":"'HULP-velden'!D58","v":""},{"$f":"'HULP-velden'!E58","v":""},{"$f":"'HULP-velden'!F58","v":""},"",{"$f":"IF(D68=\"\",\"\",'HULP-velden'!H58)","v":""},{"$f":"IF(D68=\"\",\"\",'HULP-velden'!K58)","v":""},{"$f":"'HULP-velden'!AE82","v":440000},null,{"$f":"+'HULP-velden'!AJ82","v":40},{"$f":"+'HULP-velden'!AK82","v":50},{"$f":"+'HULP-velden'!AL82","v":60},{"$f":"+'HULP-velden'!AM82","v":70},{"$f":"+'HULP-velden'!AN82","v":80},{"$f":"+'HULP-velden'!AO82","v":90},{"$f":"+'HULP-velden'!AP82","v":100}]
[null,{"$f":"'HULP-velden'!D59","v":""},{"$f":"'HULP-velden'!E59","v":""},{"$f":"'HULP-velden'!F59","v":""},"",{"$f":"IF(D69=\"\",\"\",'HULP-velden'!H59)","v":""},{"$f":"IF(D69=\"\",\"\",'HULP-velden'!K59)","v":""},{"$f":"'HULP-velden'!AE83","v":439000},null,{"$f":"+'HULP-velden'!AJ83","v":39.5},{"$f":"+'HULP-velden'!AK83","v":49.5},{"$f":"+'HULP-velden'!AL83","v":59.5},{"$f":"+'HULP-velden'!AM83","v":69.5},{"$f":"+'HULP-velden'!AN83","v":79.5},{"$f":"+'HULP-velden'!AO83","v":89.5},{"$f":"+'HULP-velden'!AP83","v":99.5}]
[null,{"$f":"'HULP-velden'!D60","v":""},{"$f":"'HULP-velden'!E60","v":""},{"$f":"'HULP-velden'!F60","v":""},"",{"$f":"IF(D70=\"\",\"\",'HULP-velden'!H60)","v":""},{"$f":"IF(D70=\"\",\"\",'HULP-velden'!K60)","v":""},{"$f":"'HULP-velden'!AE84","v":438000},null,{"$f":"+'HULP-velden'!AJ84","v":39},{"$f":"+'HULP-velden'!AK84","v":49},{"$f":"+'HULP-velden'!AL84","v":59},{"$f":"+'HULP-velden'!AM84","v":69},{"$f":"+'HULP-velden'!AN84","v":79},{"$f":"+'HULP-velden'!AO84","v":89},{"$f":"+'HULP-velden'!AP84","v":99}]
[null,{"$f":"'HULP-velden'!D61","v":""},{"$f":"'HULP-velden'!E61","v":""},{"$f":"'HULP-velden'!F61","v":""},"",{"$f":"IF(D71=\"\",\"\",'HULP-velden'!H61)","v":""},{"$f":"IF(D71=\"\",\"\",'HULP-velden'!K61)","v":""},{"$f":"'HULP-velden'!AE85","v":437000},null,{"$f":"+'HULP-velden'!AJ85","v":38.5},{"$f":"+'HULP-velden'!AK85","v":48.5},{"$f":"+'HULP-velden'!AL85","v":58.5},{"$f":"+'HULP-velden'!AM85","v":68.5},{"$f":"+'HULP-velden'!AN85","v":78.5},{"$f":"+'HULP-velden'!AO85","v":88.5},{"$f":"+'HULP-velden'!AP85","v":98.5}]
[null,{"$f":"'HULP-velden'!D62","v":""},{"$f":"'HULP-velden'!E62","v":""},{"$f":"'HULP-velden'!F62","v":""},"",{"$f":"IF(D72=\"\",\"\",'HULP-velden'!H62)","v":""},{"$f":"IF(D72=\"\",\"\",'HULP-velden'!K62)","v":""},{"$f":"'HULP-velden'!AE86","v":436000},null,{"$f":"+'HULP-velden'!AJ86","v":38},{"$f":"+'HULP-velden'!AK86","v":48},{"$f":"+'HULP-velden'!AL86","v":57.999999999999993},{"$f":"+'HULP-velden'!AM86","v":68},{"$f":"+'HULP-velden'!AN86","v":78},{"$f":"+'HULP-velden'!AO86","v":88},{"$f":"+'HULP-velden'!AP86","v":98}]
[null,{"$f":"'HULP-velden'!D63","v":"Referentie"},{"$f":"'HULP-velden'!E63","v":400000},{"$f":"'HULP-velden'!F63","v":250},50,{"$f":"IF(D73=\"\",\"\",'HULP-velden'!H63)","v":500},null,{"$f":"'HULP-velden'!AE87","v":435000},null,{"$f":"+'HULP-velden'!AJ87","v":37.5},{"$f":"+'HULP-velden'!AK87","v":47.5},{"$f":"+'HULP-velden'!AL87","v":57.499999999999993},{"$f":"+'HULP-velden'!AM87","v":67.5},{"$f":"+'HULP-velden'!AN87","v":77.5},{"$f":"+'HULP-velden'!AO87","v":87.5},{"$f":"+'HULP-velden'!AP87","v":97.5}]
[null,null,null,null,null,null,null,{"$f":"'HULP-velden'!AE88","v":434000},null,{"$f":"+'HULP-velden'!AJ88","v":37},{"$f":"+'HULP-velden'!AK88","v":47},{"$f":"+'HULP-velden'!AL88","v":56.999999999999993},{"$f":"+'HULP-velden'!AM88","v":67},{"$f":"+'HULP-velden'!AN88","v":77},{"$f":"+'HULP-velden'!AO88","v":87},{"$f":"+'HULP-velden'!AP88","v":97}]
[null,null,null,null,null,null,null,{"$f":"'HULP-velden'!AE89","v":433000},null,{"$f":"+'HULP-velden'!AJ89","v":36.5},{"$f":"+'HULP-velden'!AK89","v":46.5},{"$f":"+'HULP-velden'!AL89","v":56.499999999999993},{"$f":"+'HULP-velden'!AM89","v":66.5},{"$f":"+'HULP-velden'!AN89","v":76.5},{"$f":"+'HULP-velden'!AO89","v":86.5},{"$f":"+'HULP-velden'!AP89","v":96.5}]
[null,null,null,null,null,null,null,{"$f":"'HULP-velden'!AE90","v":432000},null,{"$f":"+'HULP-velden'!AJ90","v":36},{"$f":"+'HULP-velden'!AK90","v":46},{"$f":"+'HULP-velden'!AL90","v":56.000000000000007},{"$f":"+'HULP-velden'!AM90","v":66},{"$f":"+'HULP-velden'!AN90","v":76},{"$f":"+'HULP-velden'!AO90","v":86},{"$f":"+'HULP-velden'!AP90","v":96}]
[null,null,null,null,null,null,null,{"$f":"'HULP-velden'!AE91","v":431000},null,{"$f":"+'HULP-velden'!AJ91","v":35.5},{"$f":"+'HULP-velden'!AK91","v":45.5},{"$f":"+'HULP-velden'!AL91","v":55.500000000000007},{"$f":"+'HULP-velden'!AM91","v":65.5},{"$f":"+'HULP-velden'!AN91","v":75.5},{"$f":"+'HULP-velden'!AO91","v":85.5},{"$f":"+'HULP-velden'!AP91","v":95.5}]
[null,null,null,null,null,null,null,{"$f":"'HULP-velden'!AE92","v":430000},null,{"$f":"+'HULP-velden'!AJ92","v":35},{"$f":"+'HULP-velden'!AK92","v":45},{"$f":"+'HULP-velden'!AL92","v":55.000000000000007},{"$f":"+'HULP-velden'!AM92","v":65},{"$f":"+'HULP-velden'!AN92","v":75},{"$f":"+'HULP-velden'!AO92","v":85},{"$f":"+'HULP-velden'!AP92","v":95}]
[null,null,null,null,null,null,null,{"$f":"'HULP-velden'!AE93","v":429000},null,{"$f":"+'HULP-velden'!AJ93","v":34.5},{"$f":"+'HULP-velden'!AK93","v":44.5},{"$f":"+'HULP-velden'!AL93","v":54.500000000000007},{"$f":"+'HULP-velden'!AM93","v":64.5},{"$f":"+'HULP-velden'!AN93","v":74.5},{"$f":"+'HULP-velden'!AO93","v":84.5},{"$f":"+'HULP-velden'!AP93","v":94.5}]
[null,null,null,null,null,null,null,{"$f":"'HULP-velden'!AE94","v":428000},null,{"$f":"+'HULP-velden'!AJ94","v":34},{"$f":"+'HULP-velden'!AK94","v":44},{"$f":"+'HULP-velden'!AL94","v":54},{"$f":"+'HULP-velden'!AM94","v":64},{"$f":"+'HULP-velden'!AN94","v":74},{"$f":"+'HULP-velden'!AO94","v":84},{"$f":"+'HULP-velden'!AP94","v":94}]
[null,null,null,null,null,null,null,{"$f":"'HULP-velden'!AE95","v":427000},null,{"$f":"+'HULP-velden'!AJ95","v":33.5},{"$f":"+'HULP-velden'!AK95","v":43.5},{"$f":"+'HULP-velden'!AL95","v":53.5},{"$f":"+'HULP-velden'!AM95","v":63.5},{"$f":"+'HULP-velden'!AN95","v":73.5},{"$f":"+'HULP-velden'!AO95","v":83.5},{"$f":"+'HULP-velden'!AP95","v":93.5}]
[null,null,null,null,null,null,null,{"$f":"'HULP-velden'!AE96","v":426000},null,{"$f":"+'HULP-velden'!AJ96","v":33},{"$f":"+'HULP-velden'!AK96","v":43},{"$f":"+'HULP-velden'!AL96","v":53},{"$f":"+'HULP-velden'!AM96","v":63},{"$f":"+'HULP-velden'!AN96","v":73},{"$f":"+'HULP-velden'!AO96","v":83},{"$f":"+'HULP-velden'!AP96","v":93}]
[null,null,null,null,null,null,null,{"$f":"'HULP-velden'!AE97","v":425000},null,{"$f":"+'HULP-velden'!AJ97","v":32.5},{"$f":"+'HULP-velden'!AK97","v":42.5},{"$f":"+'HULP-velden'!AL97","v":52.5},{"$f":"+'HULP-velden'!AM97","v":62.5},{"$f":"+'HULP-velden'!AN97","v":72.5},{"$f":"+'HULP-velden'!AO97","v":82.5},{"$f":"+'HULP-velden'!AP97","v":92.5}]
[null,null,null,null,null,null,null,{"$f":"'HULP-velden'!AE98","v":424000},null,{"$f":"+'HULP-velden'!AJ98","v":32},{"$f":"+'HULP-velden'!AK98","v":42},{"$f":"+'HULP-velden'!AL98","v":52},{"$f":"+'HULP-velden'!AM98","v":62},{"$f":"+'HULP-velden'!AN98","v":72},{"$f":"+'HULP-velden'!AO98","v":82},{"$f":"+'HULP-velden'!AP98","v":92}]
[null,null,null,null,null,null,null,{"$f":"'HULP-velden'!AE99","v":423000},null,{"$f":"+'HULP-velden'!AJ99","v":31.5},{"$f":"+'HULP-velden'!AK99","v":41.5},{"$f":"+'HULP-velden'!AL99","v":51.5},{"$f":"+'HULP-velden'!AM99","v":61.5},{"$f":"+'HULP-velden'!AN99","v":71.5},{"$f":"+'HULP-velden'!AO99","v":81.5},{"$f":"+'HULP-velden'!AP99","v":91.5}]
[null,null,null,null,null,null,null,{"$f":"'HULP-velden'!AE100","v":422000},null,{"$f":"+'HULP-velden'!AJ100","v":31},{"$f":"+'HULP-velden'!AK100","v":41},{"$f":"+'HULP-velden'!AL100","v":51},{"$f":"+'HULP-velden'!AM100","v":61},{"$f":"+'HULP-velden'!AN100","v":71},{"$f":"+'HULP-velden'!AO100","v":81},{"$f":"+'HULP-velden'!AP100","v":91}]
[null,null,null,null,null,null,null,{"$f":"'HULP-velden'!AE101","v":421000},null,{"$f":"+'HULP-velden'!AJ101","v":30.5},{"$f":"+'HULP-velden'!AK101","v":40.5},{"$f":"+'HULP-velden'!AL101","v":50.5},{"$f":"+'HULP-velden'!AM101","v":60.5},{"$f":"+'HULP-velden'!AN101","v":70.5},{"$f":"+'HULP-velden'!AO101","v":80.5},{"$f":"+'HULP-velden'!AP101","v":90.5}]
[null,null,null,null,null,null,null,{"$f":"'HULP-velden'!AE102","v":420000},null,{"$f":"+'HULP-velden'!AJ102","v":30},{"$f":"+'HULP-velden'!AK102","v":40},{"$f":"+'HULP-velden'!AL102","v":50},{"$f":"+'HULP-velden'!AM102","v":60},{"$f":"+'HULP-velden'!AN102","v":70},{"$f":"+'HULP-velden'!AO102","v":80},{"$f":"+'HULP-velden'!AP102","v":90}]
[null,null,null,null,null,null,null,{"$f":"'HULP-velden'!AE103","v":419000},null,{"$f":"+'HULP-velden'!AJ103","v":29.5},{"$f":"+'HULP-velden'!AK103","v":39.5},{"$f":"+'HULP-velden'!AL103","v":49.5},{"$f":"+'HULP-velden'!AM103","v":59.5},{"$f":"+'HULP-velden'!AN103","v":69.5},{"$f":"+'HULP-velden'!AO103","v":79.5},{"$f":"+'HULP-velden'!AP103","v":89.5}]
[null,null,null,null,null,null,null,{"$f":"'HULP-velden'!AE104","v":418000},null,{"$f":"+'HULP-velden'!AJ104","v":28.999999999999996},{"$f":"+'HULP-velden'!AK104","v":39},{"$f":"+'HULP-velden'!AL104","v":49},{"$f":"+'HULP-velden'!AM104","v":59},{"$f":"+'HULP-velden'!AN104","v":69},{"$f":"+'HULP-velden'!AO104","v":79},{"$f":"+'HULP-velden'!AP104","v":89}]
[null,null,null,null,null,null,null,{"$f":"'HULP-velden'!AE105","v":417000},null,{"$f":"+'HULP-velden'!AJ105","v":28.499999999999996},{"$f":"+'HULP-velden'!AK105","v":38.5},{"$f":"+'HULP-velden'!AL105","v":48.5},{"$f":"+'HULP-velden'!AM105","v":58.5},{"$f":"+'HULP-velden'!AN105","v":68.5},{"$f":"+'HULP-velden'!AO105","v":78.5},{"$f":"+'HULP-velden'!AP105","v":88.5}]
[null,null,null,null,null,null,null,{"$f":"'HULP-velden'!AE106","v":416000},null,{"$f":"+'HULP-velden'!AJ106","v":28.000000000000004},{"$f":"+'HULP-velden'!AK106","v":38},{"$f":"+'HULP-velden'!AL106","v":48},{"$f":"+'HULP-velden'!AM106","v":57.999999999999993},{"$f":"+'HULP-velden'!AN106","v":68},{"$f":"+'HULP-velden'!AO106","v":78},{"$f":"+'HULP-velden'!AP106","v":88}]
[null,null,null,null,null,null,null,{"$f":"'HULP-velden'!AE107","v":415000},null,{"$f":"+'HULP-velden'!AJ107","v":27.500000000000004},{"$f":"+'HULP-velden'!AK107","v":37.5},{"$f":"+'HULP-velden'!AL107","v":47.5},{"$f":"+'HULP-velden'!AM107","v":57.499999999999993},{"$f":"+'HULP-velden'!AN107","v":67.5},{"$f":"+'HULP-velden'!AO107","v":77.5},{"$f":"+'HULP-velden'!AP107","v":87.5}]
[null,null,null,null,null,null,null,{"$f":"'HULP-velden'!AE108","v":414000},null,{"$f":"+'HULP-velden'!AJ108","v":27},{"$f":"+'HULP-velden'!AK108","v":37},{"$f":"+'HULP-velden'!AL108","v":47},{"$f":"+'HULP-velden'!AM108","v":56.999999999999993},{"$f":"+'HULP-velden'!AN108","v":67},{"$f":"+'HULP-velden'!AO108","v":77},{"$f":"+'HULP-velden'!AP108","v":87}]
[null,null,null,null,null,null,null,{"$f":"'HULP-velden'!AE109","v":413000},null,{"$f":"+'HULP-velden'!AJ109","v":26.5},{"$f":"+'HULP-velden'!AK109","v":36.5},{"$f":"+'HULP-velden'!AL109","v":46.5},{"$f":"+'HULP-velden'!AM109","v":56.499999999999993},{"$f":"+'HULP-velden'!AN109","v":66.5},{"$f":"+'HULP-velden'!AO109","v":76.5},{"$f":"+'HULP-velden'!AP109","v":86.5}]
[null,null,null,null,null,null,null,{"$f":"'HULP-velden'!AE110","v":412000},null,{"$f":"+'HULP-velden'!AJ110","v":26},{"$f":"+'HULP-velden'!AK110","v":36},{"$f":"+'HULP-velden'!AL110","v":46},{"$f":"+'HULP-velden'!AM110","v":56.000000000000007},{"$f":"+'HULP-velden'!AN110","v":66},{"$f":"+'HULP-velden'!AO110","v":76},{"$f":"+'HULP-velden'!AP110","v":86}]
[null,null,null,null,null,null,null,{"$f":"'HULP-velden'!AE111","v":411000},null,{"$f":"+'HULP-velden'!AJ111","v":25.5},{"$f":"+'HULP-velden'!AK111","v":35.5},{"$f":"+'HULP-velden'!AL111","v":45.5},{"$f":"+'HULP-velden'!AM111","v":55.500000000000007},{"$f":"+'HULP-velden'!AN111","v":65.5},{"$f":"+'HULP-velden'!AO111","v":75.5},{"$f":"+'HULP-velden'!AP111","v":85.5}]
[null,null,null,null,null,null,null,{"$f":"'HULP-velden'!AE112","v":410000},null,{"$f":"+'HULP-velden'!AJ112","v":25},{"$f":"+'HULP-velden'!AK112","v":35},{"$f":"+'HULP-velden'!AL112","v":45},{"$f":"+'HULP-velden'!AM112","v":55.000000000000007},{"$f":"+'HULP-velden'!AN112","v":65},{"$f":"+'HULP-velden'!AO112","v":75},{"$f":"+'HULP-velden'!AP112","v":85}]
[null,null,null,null,null,null,null,{"$f":"'HULP-velden'!AE113","v":409000},null,{"$f":"+'HULP-velden'!AJ113","v":24.5},{"$f":"+'HULP-velden'!AK113","v":34.5},{"$f":"+'HULP-velden'!AL113","v":44.5},{"$f":"+'HULP-velden'!AM113","v":54.500000000000007},{"$f":"+'HULP-velden'!AN113","v":64.5},{"$f":"+'HULP-velden'!AO113","v":74.5},{"$f":"+'HULP-velden'!AP113","v":84.5}]
[null,null,null,null,null,null,null,{"$f":"'HULP-velden'!AE114","v":408000},null,{"$f":"+'HULP-velden'!AJ114","v":24},{"$f":"+'HULP-velden'!AK114","v":34},{"$f":"+'HULP-velden'!AL114","v":44},{"$f":"+'HULP-velden'!AM114","v":54},{"$f":"+'HULP-velden'!AN114","v":64},{"$f":"+'HULP-velden'!AO114","v":74},{"$f":"+'HULP-velden'!AP114","v":84}]
[null,null,null,null,null,null,null,{"$f":"'HULP-velden'!AE115","v":407000},null,{"$f":"+'HULP-velden'!AJ115","v":23.5},{"$f":"+'HULP-velden'!AK115","v":33.5},{"$f":"+'HULP-velden'!AL115","v":43.5},{"$f":"+'HULP-velden'!AM115","v":53.5},{"$f":"+'HULP-velden'!AN115","v":63.5},{"$f":"+'HULP-velden'!AO115","v":73.5},{"$f":"+'HULP-velden'!AP115","v":83.5}]
[null,null,null,null,null,null,null,{"$f":"'HULP-velden'!AE116","v":406000},null,{"$f":"+'HULP-velden'!AJ116","v":23},{"$f":"+'HULP-velden'!AK116","v":33},{"$f":"+'HULP-velden'!AL116","v":43},{"$f":"+'HULP-velden'!AM116","v":53},{"$f":"+'HULP-velden'!AN116","v":63},{"$f":"+'HULP-velden'!AO116","v":73},{"$f":"+'HULP-velden'!AP116","v":83}]
[null,null,null,null,null,null,null,{"$f":"'HULP-velden'!AE117","v":405000},null,{"$f":"+'HULP-velden'!AJ117","v":22.5},{"$f":"+'HULP-velden'!AK117","v":32.5},{"$f":"+'HULP-velden'!AL117","v":42.5},{"$f":"+'HULP-velden'!AM117","v":52.5},{"$f":"+'HULP-velden'!AN117","v":62.5},{"$f":"+'HULP-velden'!AO117","v":72.5},{"$f":"+'HULP-velden'!AP117","v":82.5}]
[null,null,null,null,null,null,null,{"$f":"'HULP-velden'!AE118","v":404000},null,{"$f":"+'HULP-velden'!AJ118","v":22},{"$f":"+'HULP-velden'!AK118","v":32},{"$f":"+'HULP-velden'!AL118","v":42},{"$f":"+'HULP-velden'!AM118","v":52},{"$f":"+'HULP-velden'!AN118","v":62},{"$f":"+'HULP-velden'!AO118","v":72},{"$f":"+'HULP-velden'!AP118","v":82}]
[null,null,null,null,null,null,null,{"$f":"'HULP-velden'!AE119","v":403000},null,{"$f":"+'HULP-velden'!AJ119","v":21.5},{"$f":"+'HULP-velden'!AK119","v":31.5},{"$f":"+'HULP-velden'!AL119","v":41.5},{"$f":"+'HULP-velden'!AM119","v":51.5},{"$f":"+'HULP-velden'!AN119","v":61.5},{"$f":"+'HULP-velden'!AO119","v":71.5},{"$f":"+'HULP-velden'!AP119","v":81.5}]
[null,null,null,null,null,null,null,{"$f":"'HULP-velden'!AE120","v":402000},null,{"$f":"+'HULP-velden'!AJ120","v":21},{"$f":"+'HULP-velden'!AK120","v":31},{"$f":"+'HULP-velden'!AL120","v":41},{"$f":"+'HULP-velden'!AM120","v":51},{"$f":"+'HULP-velden'!AN120","v":61},{"$f":"+'HULP-velden'!AO120","v":71},{"$f":"+'HULP-velden'!AP120","v":81}]
[null,null,null,null,null,null,null,{"$f":"'HULP-velden'!AE121","v":401000},null,{"$f":"+'HULP-velden'!AJ121","v":20.5},{"$f":"+'HULP-velden'!AK121","v":30.5},{"$f":"+'HULP-velden'!AL121","v":40.5},{"$f":"+'HULP-velden'!AM121","v":50.5},{"$f":"+'HULP-velden'!AN121","v":60.5},{"$f":"+'HULP-velden'!AO121","v":70.5},{"$f":"+'HULP-velden'!AP121","v":80.5}]
[null,null,null,null,null,null,null,{"$f":"'HULP-velden'!AE122","v":400000},null,{"$f":"+'HULP-velden'!AJ122","v":20},{"$f":"+'HULP-velden'!AK122","v":30},{"$f":"+'HULP-velden'!AL122","v":40},{"$f":"+'HULP-velden'!AM122","v":50},{"$f":"+'HULP-velden'!AN122","v":60},{"$f":"+'HULP-velden'!AO122","v":70},{"$f":"+'HULP-velden'!AP122","v":80}]
[null,null,null,null,null,null,null,{"$f":"'HULP-velden'!AE123","v":399000},null,{"$f":"+'HULP-velden'!AJ123","v":19.5},{"$f":"+'HULP-velden'!AK123","v":29.5},{"$f":"+'HULP-velden'!AL123","v":39.5},{"$f":"+'HULP-velden'!AM123","v":49.5},{"$f":"+'HULP-velden'!AN123","v":59.5},{"$f":"+'HULP-velden'!AO123","v":69.5},{"$f":"+'HULP-velden'!AP123","v":79.5}]
[null,null,null,null,null,null,null,{"$f":"'HULP-velden'!AE124","v":398000},null,{"$f":"+'HULP-velden'!AJ124","v":19},{"$f":"+'HULP-velden'!AK124","v":28.999999999999996},{"$f":"+'HULP-velden'!AL124","v":39},{"$f":"+'HULP-velden'!AM124","v":49},{"$f":"+'HULP-velden'!AN124","v":59},{"$f":"+'HULP-velden'!AO124","v":69},{"$f":"+'HULP-velden'!AP124","v":79}]
[null,null,null,null,null,null,null,{"$f":"'HULP-velden'!AE125","v":397000},null,{"$f":"+'HULP-velden'!AJ125","v":18.5},{"$f":"+'HULP-velden'!AK125","v":28.499999999999996},{"$f":"+'HULP-velden'!AL125","v":38.5},{"$f":"+'HULP-velden'!AM125","v":48.5},{"$f":"+'HULP-velden'!AN125","v":58.5},{"$f":"+'HULP-velden'!AO125","v":68.5},{"$f":"+'HULP-velden'!AP125","v":78.5}]
[null,null,null,null,null,null,null,{"$f":"'HULP-velden'!AE126","v":396000},null,{"$f":"+'HULP-velden'!AJ126","v":18},{"$f":"+'HULP-velden'!AK126","v":28.000000000000004},{"$f":"+'HULP-velden'!AL126","v":38},{"$f":"+'HULP-velden'!AM126","v":48},{"$f":"+'HULP-velden'!AN126","v":57.999999999999993},{"$f":"+'HULP-velden'!AO126","v":68},{"$f":"+'HULP-velden'!AP126","v":78}]
[null,null,null,null,null,null,null,{"$f":"'HULP-velden'!AE127","v":395000},null,{"$f":"+'HULP-velden'!AJ127","v":17.5},{"$f":"+'HULP-velden'!AK127","v":27.500000000000004},{"$f":"+'HULP-velden'!AL127","v":37.5},{"$f":"+'HULP-velden'!AM127","v":47.5},{"$f":"+'HULP-velden'!AN127","v":57.499999999999993},{"$f":"+'HULP-velden'!AO127","v":67.5},{"$f":"+'HULP-velden'!AP127","v":77.5}]
[null,null,null,null,null,null,null,{"$f":"'HULP-velden'!AE128","v":394000},null,{"$f":"+'HULP-velden'!AJ128","v":17},{"$f":"+'HULP-velden'!AK128","v":27},{"$f":"+'HULP-velden'!AL128","v":37},{"$f":"+'HULP-velden'!AM128","v":47},{"$f":"+'HULP-velden'!AN128","v":56.999999999999993},{"$f":"+'HULP-velden'!AO128","v":67},{"$f":"+'HULP-velden'!AP128","v":77}]
[null,null,null,null,null,null,null,{"$f":"'HULP-velden'!AE129","v":393000},null,{"$f":"+'HULP-velden'!AJ129","v":16.5},{"$f":"+'HULP-velden'!AK129","v":26.5},{"$f":"+'HULP-velden'!AL129","v":36.5},{"$f":"+'HULP-velden'!AM129","v":46.5},{"$f":"+'HULP-velden'!AN129","v":56.499999999999993},{"$f":"+'HULP-velden'!AO129","v":66.5},{"$f":"+'HULP-velden'!AP129","v":76.5}]
[null,null,null,null,null,null,null,{"$f":"'HULP-velden'!AE130","v":392000},null,{"$f":"+'HULP-velden'!AJ130","v":16},{"$f":"+'HULP-velden'!AK130","v":26},{"$f":"+'HULP-velden'!AL130","v":36},{"$f":"+'HULP-velden'!AM130","v":46},{"$f":"+'HULP-velden'!AN130","v":56.000000000000007},{"$f":"+'HULP-velden'!AO130","v":66},{"$f":"+'HULP-velden'!AP130","v":76}]
[null,null,null,null,null,null,null,{"$f":"'HULP-velden'!AE131","v":391000},null,{"$f":"+'HULP-velden'!AJ131","v":15.5},{"$f":"+'HULP-velden'!AK131","v":25.5},{"$f":"+'HULP-velden'!AL131","v":35.5},{"$f":"+'HULP-velden'!AM131","v":45.5},{"$f":"+'HULP-velden'!AN131","v":55.500000000000007},{"$f":"+'HULP-velden'!AO131","v":65.5},{"$f":"+'HULP-velden'!AP131","v":75.5}]
[null,null,null,null,null,null,null,{"$f":"'HULP-velden'!AE132","v":390000},null,{"$f":"+'HULP-velden'!AJ132","v":15},{"$f":"+'HULP-velden'!AK132","v":25},{"$f":"+'HULP-velden'!AL132","v":35},{"$f":"+'HULP-velden'!AM132","v":45},{"$f":"+'HULP-velden'!AN132","v":55.000000000000007},{"$f":"+'HULP-velden'!AO132","v":65},{"$f":"+'HULP-velden'!AP132","v":75}]
[null,null,null,null,null,null,null,{"$f":"'HULP-velden'!AE133","v":389000},null,{"$f":"+'HULP-velden'!AJ133","v":14.499999999999998},{"$f":"+'HULP-velden'!AK133","v":24.5},{"$f":"+'HULP-velden'!AL133","v":34.5},{"$f":"+'HULP-velden'!AM133","v":44.5},{"$f":"+'HULP-velden'!AN133","v":54.500000000000007},{"$f":"+'HULP-velden'!AO133","v":64.5},{"$f":"+'HULP-velden'!AP133","v":74.5}]
[null,null,null,null,null,null,null,{"$f":"'HULP-velden'!AE134","v":388000},null,{"$f":"+'HULP-velden'!AJ134","v":14.000000000000002},{"$f":"+'HULP-velden'!AK134","v":24},{"$f":"+'HULP-velden'!AL134","v":34},{"$f":"+'HULP-velden'!AM134","v":44},{"$f":"+'HULP-velden'!AN134","v":54},{"$f":"+'HULP-velden'!AO134","v":64},{"$f":"+'HULP-velden'!AP134","v":74}]
[null,null,null,null,null,null,null,{"$f":"'HULP-velden'!AE135","v":387000},null,{"$f":"+'HULP-velden'!AJ135","v":13.5},{"$f":"+'HULP-velden'!AK135","v":23.5},{"$f":"+'HULP-velden'!AL135","v":33.5},{"$f":"+'HULP-velden'!AM135","v":43.5},{"$f":"+'HULP-velden'!AN135","v":53.5},{"$f":"+'HULP-velden'!AO135","v":63.5},{"$f":"+'HULP-velden'!AP135","v":73.5}]
[null,null,null,null,null,null,null,{"$f":"'HULP-velden'!AE136","v":386000},null,{"$f":"+'HULP-velden'!AJ136","v":13},{"$f":"+'HULP-velden'!AK136","v":23},{"$f":"+'HULP-velden'!AL136","v":33},{"$f":"+'HULP-velden'!AM136","v":43},{"$f":"+'HULP-velden'!AN136","v":53},{"$f":"+'HULP-velden'!AO136","v":63},{"$f":"+'HULP-velden'!AP136","v":73}]
[null,null,null,null,null,null,null,{"$f":"'HULP-velden'!AE137","v":385000},null,{"$f":"+'HULP-velden'!AJ137","v":12.5},{"$f":"+'HULP-velden'!AK137","v":22.5},{"$f":"+'HULP-velden'!AL137","v":32.5},{"$f":"+'HULP-velden'!AM137","v":42.5},{"$f":"+'HULP-velden'!AN137","v":52.5},{"$f":"+'HULP-velden'!AO137","v":62.5},{"$f":"+'HULP-velden'!AP137","v":72.5}]
[null,null,null,null,null,null,null,{"$f":"'HULP-velden'!AE138","v":384000},null,{"$f":"+'HULP-velden'!AJ138","v":12},{"$f":"+'HULP-velden'!AK138","v":22},{"$f":"+'HULP-velden'!AL138","v":32},{"$f":"+'HULP-velden'!AM138","v":42},{"$f":"+'HULP-velden'!AN138","v":52},{"$f":"+'HULP-velden'!AO138","v":62},{"$f":"+'HULP-velden'!AP138","v":72}]
[null,null,null,null,null,null,null,{"$f":"'HULP-velden'!AE139","v":383000},null,{"$f":"+'HULP-velden'!AJ139","v":11.5},{"$f":"+'HULP-velden'!AK139","v":21.5},{"$f":"+'HULP-velden'!AL139","v":31.5},{"$f":"+'HULP-velden'!AM139","v":41.5},{"$f":"+'HULP-velden'!AN139","v":51.5},{"$f":"+'HULP-velden'!AO139","v":61.5},{"$f":"+'HULP-velden'!AP139","v":71.5}]
[null,null,null,null,null,null,null,{"$f":"'HULP-velden'!AE140","v":382000},null,{"$f":"+'HULP-velden'!AJ140","v":11},{"$f":"+'HULP-velden'!AK140","v":21},{"$f":"+'HULP-velden'!AL140","v":31},{"$f":"+'HULP-velden'!AM140","v":41},{"$f":"+'HULP-velden'!AN140","v":51},{"$f":"+'HULP-velden'!AO140","v":61},{"$f":"+'HULP-velden'!AP140","v":71}]
[null,null,null,null,null,null,null,{"$f":"'HULP-velden'!AE141","v":381000},null,{"$f":"+'HULP-velden'!AJ141","v":10.5},{"$f":"+'HULP-velden'!AK141","v":20.5},{"$f":"+'HULP-velden'!AL141","v":30.5},{"$f":"+'HULP-velden'!AM141","v":40.5},{"$f":"+'HULP-velden'!AN141","v":50.5},{"$f":"+'HULP-velden'!AO141","v":60.5},{"$f":"+'HULP-velden'!AP141","v":70.5}]
[null,null,null,null,null,null,null,{"$f":"'HULP-velden'!AE142","v":380000},null,{"$f":"+'HULP-velden'!AJ142","v":10},{"$f":"+'HULP-velden'!AK142","v":20},{"$f":"+'HULP-velden'!AL142","v":30},{"$f":"+'HULP-velden'!AM142","v":40},{"$f":"+'HULP-velden'!AN142","v":50},{"$f":"+'HULP-velden'!AO142","v":60},{"$f":"+'HULP-velden'!AP142","v":70}]
[null,null,null,null,null,null,null,{"$f":"'HULP-velden'!AE143","v":379000},null,{"$f":"+'HULP-velden'!AJ143","v":9.5},{"$f":"+'HULP-velden'!AK143","v":19.5},{"$f":"+'HULP-velden'!AL143","v":29.5},{"$f":"+'HULP-velden'!AM143","v":39.5},{"$f":"+'HULP-velden'!AN143","v":49.5},{"$f":"+'HULP-velden'!AO143","v":59.5},{"$f":"+'HULP-velden'!AP143","v":69.5}]
[null,null,null,null,null,null,null,{"$f":"'HULP-velden'!AE144","v":378000},null,{"$f":"+'HULP-velden'!AJ144","v":9},{"$f":"+'HULP-velden'!AK144","v":19},{"$f":"+'HULP-velden'!AL144","v":28.999999999999996},{"$f":"+'HULP-velden'!AM144","v":39},{"$f":"+'HULP-velden'!AN144","v":49},{"$f":"+'HULP-velden'!AO144","v":59},{"$f":"+'HULP-velden'!AP144","v":69}]
[null,null,null,null,null,null,null,{"$f":"'HULP-velden'!AE145","v":377000},null,{"$f":"+'HULP-velden'!AJ145","v":8.5},{"$f":"+'HULP-velden'!AK145","v":18.5},{"$f":"+'HULP-velden'!AL145","v":28.499999999999996},{"$f":"+'HULP-velden'!AM145","v":38.5},{"$f":"+'HULP-velden'!AN145","v":48.5},{"$f":"+'HULP-velden'!AO145","v":58.5},{"$f":"+'HULP-velden'!AP145","v":68.5}]
[null,null,null,null,null,null,null,{"$f":"'HULP-velden'!AE146","v":376000},null,{"$f":"+'HULP-velden'!AJ146","v":8},{"$f":"+'HULP-velden'!AK146","v":18},{"$f":"+'HULP-velden'!AL146","v":28.000000000000004},{"$f":"+'HULP-velden'!AM146","v":38},{"$f":"+'HULP-velden'!AN146","v":48},{"$f":"+'HULP-velden'!AO146","v":57.999999999999993},{"$f":"+'HULP-velden'!AP146","v":68}]
[null,null,null,null,null,null,null,{"$f":"'HULP-velden'!AE147","v":375000},null,{"$f":"+'HULP-velden'!AJ147","v":7.5},{"$f":"+'HULP-velden'!AK147","v":17.5},{"$f":"+'HULP-velden'!AL147","v":27.500000000000004},{"$f":"+'HULP-velden'!AM147","v":37.5},{"$f":"+'HULP-velden'!AN147","v":47.5},{"$f":"+'HULP-velden'!AO147","v":57.499999999999993},{"$f":"+'HULP-velden'!AP147","v":67.5}]
[null,null,null,null,null,null,null,{"$f":"'HULP-velden'!AE148","v":374000},null,{"$f":"+'HULP-velden'!AJ148","v":7.0000000000000009},{"$f":"+'HULP-velden'!AK148","v":17},{"$f":"+'HULP-velden'!AL148","v":27},{"$f":"+'HULP-velden'!AM148","v":37},{"$f":"+'HULP-velden'!AN148","v":47},{"$f":"+'HULP-velden'!AO148","v":56.999999999999993},{"$f":"+'HULP-velden'!AP148","v":67}]
[null,null,null,null,null,null,null,{"$f":"'HULP-velden'!AE149","v":373000},null,{"$f":"+'HULP-velden'!AJ149","v":6.5},{"$f":"+'HULP-velden'!AK149","v":16.5},{"$f":"+'HULP-velden'!AL149","v":26.5},{"$f":"+'HULP-velden'!AM149","v":36.5},{"$f":"+'HULP-velden'!AN149","v":46.5},{"$f":"+'HULP-velden'!AO149","v":56.499999999999993},{"$f":"+'HULP-velden'!AP149","v":66.5}]
[null,null,null,null,null,null,null,{"$f":"'HULP-velden'!AE150","v":372000},null,{"$f":"+'HULP-velden'!AJ150","v":6},{"$f":"+'HULP-velden'!AK150","v":16},{"$f":"+'HULP-velden'!AL150","v":26},{"$f":"+'HULP-velden'!AM150","v":36},{"$f":"+'HULP-velden'!AN150","v":46},{"$f":"+'HULP-velden'!AO150","v":56.000000000000007},{"$f":"+'HULP-velden'!AP150","v":66}]
[null,null,null,null,null,null,null,{"$f":"'HULP-velden'!AE151","v":371000},null,{"$f":"+'HULP-velden'!AJ151","v":5.5},{"$f":"+'HULP-velden'!AK151","v":15.5},{"$f":"+'HULP-velden'!AL151","v":25.5},{"$f":"+'HULP-velden'!AM151","v":35.5},{"$f":"+'HULP-velden'!AN151","v":45.5},{"$f":"+'HULP-velden'!AO151","v":55.500000000000007},{"$f":"+'HULP-velden'!AP151","v":65.5}]
[null,null,null,null,null,null,null,{"$f":"'HULP-velden'!AE152","v":370000},null,{"$f":"+'HULP-velden'!AJ152","v":5},{"$f":"+'HULP-velden'!AK152","v":15},{"$f":"+'HULP-velden'!AL152","v":25},{"$f":"+'HULP-velden'!AM152","v":35},{"$f":"+'HULP-velden'!AN152","v":45},{"$f":"+'HULP-velden'!AO152","v":55.000000000000007},{"$f":"+'HULP-velden'!AP152","v":65}]
[null,null,null,null,null,null,null,{"$f":"'HULP-velden'!AE153","v":369000},null,{"$f":"+'HULP-velden'!AJ153","v":4.5},{"$f":"+'HULP-velden'!AK153","v":14.499999999999998},{"$f":"+'HULP-velden'!AL153","v":24.5},{"$f":"+'HULP-velden'!AM153","v":34.5},{"$f":"+'HULP-velden'!AN153","v":44.5},{"$f":"+'HULP-velden'!AO153","v":54.500000000000007},{"$f":"+'HULP-velden'!AP153","v":64.5}]
[null,null,null,null,null,null,null,{"$f":"'HULP-velden'!AE154","v":368000},null,{"$f":"+'HULP-velden'!AJ154","v":4},{"$f":"+'HULP-velden'!AK154","v":14.000000000000002},{"$f":"+'HULP-velden'!AL154","v":24},{"$f":"+'HULP-velden'!AM154","v":34},{"$f":"+'HULP-velden'!AN154","v":44},{"$f":"+'HULP-velden'!AO154","v":54},{"$f":"+'HULP-velden'!AP154","v":64}]
[null,null,null,null,null,null,null,{"$f":"'HULP-velden'!AE155","v":367000},null,{"$f":"+'HULP-velden'!AJ155","v":3.5000000000000004},{"$f":"+'HULP-velden'!AK155","v":13.5},{"$f":"+'HULP-velden'!AL155","v":23.5},{"$f":"+'HULP-velden'!AM155","v":33.5},{"$f":"+'HULP-velden'!AN155","v":43.5},{"$f":"+'HULP-velden'!AO155","v":53.5},{"$f":"+'HULP-velden'!AP155","v":63.5}]
[null,null,null,null,null,null,null,{"$f":"'HULP-velden'!AE156","v":366000},null,{"$f":"+'HULP-velden'!AJ156","v":3},{"$f":"+'HULP-velden'!AK156","v":13},{"$f":"+'HULP-velden'!AL156","v":23},{"$f":"+'HULP-velden'!AM156","v":33},{"$f":"+'HULP-velden'!AN156","v":43},{"$f":"+'HULP-velden'!AO156","v":53},{"$f":"+'HULP-velden'!AP156","v":63}]
[null,null,null,null,null,null,null,{"$f":"'HULP-velden'!AE157","v":365000},null,{"$f":"+'HULP-velden'!AJ157","v":2.5},{"$f":"+'HULP-velden'!AK157","v":12.5},{"$f":"+'HULP-velden'!AL157","v":22.5},{"$f":"+'HULP-velden'!AM157","v":32.5},{"$f":"+'HULP-velden'!AN157","v":42.5},{"$f":"+'HULP-velden'!AO157","v":52.5},{"$f":"+'HULP-velden'!AP157","v":62.5}]
[null,null,null,null,null,null,null,{"$f":"'HULP-velden'!AE158","v":364000},null,{"$f":"+'HULP-velden'!AJ158","v":2},{"$f":"+'HULP-velden'!AK158","v":12},{"$f":"+'HULP-velden'!AL158","v":22},{"$f":"+'HULP-velden'!AM158","v":32},{"$f":"+'HULP-velden'!AN158","v":42},{"$f":"+'HULP-velden'!AO158","v":52},{"$f":"+'HULP-velden'!AP158","v":62}]
[null,null,null,null,null,null,null,{"$f":"'HULP-velden'!AE159","v":363000},null,{"$f":"+'HULP-velden'!AJ159","v":1.5},{"$f":"+'HULP-velden'!AK159","v":11.5},{"$f":"+'HULP-velden'!AL159","v":21.5},{"$f":"+'HULP-velden'!AM159","v":31.5},{"$f":"+'HULP-velden'!AN159","v":41.5},{"$f":"+'HULP-velden'!AO159","v":51.5},{"$f":"+'HULP-velden'!AP159","v":61.5}]
[null,null,null,null,null,null,null,{"$f":"'HULP-velden'!AE160","v":362000},null,{"$f":"+'HULP-velden'!AJ160","v":1},{"$f":"+'HULP-velden'!AK160","v":11},{"$f":"+'HULP-velden'!AL160","v":21},{"$f":"+'HULP-velden'!AM160","v":31},{"$f":"+'HULP-velden'!AN160","v":41},{"$f":"+'HULP-velden'!AO160","v":51},{"$f":"+'HULP-velden'!AP160","v":61}]
[null,null,null,null,null,null,null,{"$f":"'HULP-velden'!AE161","v":361000},null,{"$f":"+'HULP-velden'!AJ161","v":0.5},{"$f":"+'HULP-velden'!AK161","v":10.5},{"$f":"+'HULP-velden'!AL161","v":20.5},{"$f":"+'HULP-velden'!AM161","v":30.5},{"$f":"+'HULP-velden'!AN161","v":40.5},{"$f":"+'HULP-velden'!AO161","v":50.5},{"$f":"+'HULP-velden'!AP161","v":60.5}]
[null,null,null,null,null,null,null,{"$f":"'HULP-velden'!AE162","v":360000},null,{"$f":"+'HULP-velden'!AJ162","v":0},{"$f":"+'HULP-velden'!AK162","v":10},{"$f":"+'HULP-velden'!AL162","v":20},{"$f":"+'HULP-velden'!AM162","v":30},{"$f":"+'HULP-velden'!AN162","v":40},{"$f":"+'HULP-velden'!AO162","v":50},{"$f":"+'HULP-velden'!AP162","v":60}]
[null,null,null,null,null,null,null,{"$f":"'HULP-velden'!AE163","v":359000},null,{"$f":"+'HULP-velden'!AJ163","v":-0.5},{"$f":"+'HULP-velden'!AK163","v":9.5},{"$f":"+'HULP-velden'!AL163","v":19.5},{"$f":"+'HULP-velden'!AM163","v":29.5},{"$f":"+'HULP-velden'!AN163","v":39.5},{"$f":"+'HULP-velden'!AO163","v":49.5},{"$f":"+'HULP-velden'!AP163","v":59.5}]
[null,null,null,null,null,null,null,{"$f":"'HULP-velden'!AE164","v":358000},null,{"$f":"+'HULP-velden'!AJ164","v":-1},{"$f":"+'HULP-velden'!AK164","v":9},{"$f":"+'HULP-velden'!AL164","v":19},{"$f":"+'HULP-velden'!AM164","v":28.999999999999996},{"$f":"+'HULP-velden'!AN164","v":39},{"$f":"+'HULP-velden'!AO164","v":49},{"$f":"+'HULP-velden'!AP164","v":59}]
[null,null,null,null,null,null,null,{"$f":"'HULP-velden'!AE165","v":357000},null,{"$f":"+'HULP-velden'!AJ165","v":-1.5},{"$f":"+'HULP-velden'!AK165","v":8.5},{"$f":"+'HULP-velden'!AL165","v":18.5},{"$f":"+'HULP-velden'!AM165","v":28.499999999999996},{"$f":"+'HULP-velden'!AN165","v":38.5},{"$f":"+'HULP-velden'!AO165","v":48.5},{"$f":"+'HULP-velden'!AP165","v":58.5}]
[null,null,null,null,null,null,null,{"$f":"'HULP-velden'!AE167","v":356000},null,{"$f":"+'HULP-velden'!AJ167","v":-2},{"$f":"+'HULP-velden'!AK167","v":8},{"$f":"+'HULP-velden'!AL167","v":18},{"$f":"+'HULP-velden'!AM167","v":28.000000000000004},{"$f":"+'HULP-velden'!AN167","v":38},{"$f":"+'HULP-velden'!AO167","v":48},{"$f":"+'HULP-velden'!AP167","v":57.999999999999993}]
[null,null,null,null,null,null,null,{"$f":"'HULP-velden'!AE168","v":355000},null,{"$f":"+'HULP-velden'!AJ168","v":-2.5},{"$f":"+'HULP-velden'!AK168","v":7.5},{"$f":"+'HULP-velden'!AL168","v":17.5},{"$f":"+'HULP-velden'!AM168","v":27.500000000000004},{"$f":"+'HULP-velden'!AN168","v":37.5},{"$f":"+'HULP-velden'!AO168","v":47.5},{"$f":"+'HULP-velden'!AP168","v":57.499999999999993}]
[null,null,null,null,null,null,null,{"$f":"'HULP-velden'!AE169","v":354000},null,{"$f":"+'HULP-velden'!AJ169","v":-3},{"$f":"+'HULP-velden'!AK169","v":7.0000000000000009},{"$f":"+'HULP-velden'!AL169","v":17},{"$f":"+'HULP-velden'!AM169","v":27},{"$f":"+'HULP-velden'!AN169","v":37},{"$f":"+'HULP-velden'!AO169","v":47},{"$f":"+'HULP-velden'!AP169","v":56.999999999999993}]
[null,null,null,null,null,null,null,{"$f":"'HULP-velden'!AE170","v":353000},null,{"$f":"+'HULP-velden'!AJ170","v":-3.5000000000000004},{"$f":"+'HULP-velden'!AK170","v":6.5},{"$f":"+'HULP-velden'!AL170","v":16.5},{"$f":"+'HULP-velden'!AM170","v":26.5},{"$f":"+'HULP-velden'!AN170","v":36.5},{"$f":"+'HULP-velden'!AO170","v":46.5},{"$f":"+'HULP-velden'!AP170","v":56.499999999999993}]
[null,null,null,null,null,null,null,{"$f":"'HULP-velden'!AE171","v":352000},null,{"$f":"+'HULP-velden'!AJ171","v":-4},{"$f":"+'HULP-velden'!AK171","v":6},{"$f":"+'HULP-velden'!AL171","v":16},{"$f":"+'HULP-velden'!AM171","v":26},{"$f":"+'HULP-velden'!AN171","v":36},{"$f":"+'HULP-velden'!AO171","v":46},{"$f":"+'HULP-velden'!AP171","v":56.000000000000007}]
[null,null,null,null,null,null,null,{"$f":"'HULP-velden'!AE172","v":351000},null,{"$f":"+'HULP-velden'!AJ172","v":-4.5},{"$f":"+'HULP-velden'!AK172","v":5.5},{"$f":"+'HULP-velden'!AL172","v":15.5},{"$f":"+'HULP-velden'!AM172","v":25.5},{"$f":"+'HULP-velden'!AN172","v":35.5},{"$f":"+'HULP-velden'!AO172","v":45.5},{"$f":"+'HULP-velden'!AP172","v":55.500000000000007}]
[null,null,null,null,null,null,null,{"$f":"'HULP-velden'!AE173","v":350000},null,{"$f":"+'HULP-velden'!AJ173","v":-5},{"$f":"+'HULP-velden'!AK173","v":5},{"$f":"+'HULP-velden'!AL173","v":15},{"$f":"+'HULP-velden'!AM173","v":25},{"$f":"+'HULP-velden'!AN173","v":35},{"$f":"+'HULP-velden'!AO173","v":45},{"$f":"+'HULP-velden'!AP173","v":55.000000000000007}]
[null,null,null,null,null,null,null,{"$f":"'HULP-velden'!AE174","v":349000},null,{"$f":"+'HULP-velden'!AJ174","v":-5.5},{"$f":"+'HULP-velden'!AK174","v":4.5},{"$f":"+'HULP-velden'!AL174","v":14.499999999999998},{"$f":"+'HULP-velden'!AM174","v":24.5},{"$f":"+'HULP-velden'!AN174","v":34.5},{"$f":"+'HULP-velden'!AO174","v":44.5},{"$f":"+'HULP-velden'!AP174","v":54.500000000000007}]
[null,null,null,null,null,null,null,{"$f":"'HULP-velden'!AE175","v":348000},null,{"$f":"+'HULP-velden'!AJ175","v":-6},{"$f":"+'HULP-velden'!AK175","v":4},{"$f":"+'HULP-velden'!AL175","v":14.000000000000002},{"$f":"+'HULP-velden'!AM175","v":24},{"$f":"+'HULP-velden'!AN175","v":34},{"$f":"+'HULP-velden'!AO175","v":44},{"$f":"+'HULP-velden'!AP175","v":54}]
[null,null,null,null,null,null,null,{"$f":"'HULP-velden'!AE176","v":347000},null,{"$f":"+'HULP-velden'!AJ176","v":-6.5},{"$f":"+'HULP-velden'!AK176","v":3.5000000000000004},{"$f":"+'HULP-velden'!AL176","v":13.5},{"$f":"+'HULP-velden'!AM176","v":23.5},{"$f":"+'HULP-velden'!AN176","v":33.5},{"$f":"+'HULP-velden'!AO176","v":43.5},{"$f":"+'HULP-velden'!AP176","v":53.5}]
[null,null,null,null,null,null,null,{"$f":"'HULP-velden'!AE177","v":346000},null,{"$f":"+'HULP-velden'!AJ177","v":-7.0000000000000009},{"$f":"+'HULP-velden'!AK177","v":3},{"$f":"+'HULP-velden'!AL177","v":13},{"$f":"+'HULP-velden'!AM177","v":23},{"$f":"+'HULP-velden'!AN177","v":33},{"$f":"+'HULP-velden'!AO177","v":43},{"$f":"+'HULP-velden'!AP177","v":53}]
[null,null,null,null,null,null,null,{"$f":"'HULP-velden'!AE178","v":345000},null,{"$f":"+'HULP-velden'!AJ178","v":-7.5},{"$f":"+'HULP-velden'!AK178","v":2.5},{"$f":"+'HULP-velden'!AL178","v":12.5},{"$f":"+'HULP-velden'!AM178","v":22.5},{"$f":"+'HULP-velden'!AN178","v":32.5},{"$f":"+'HULP-velden'!AO178","v":42.5},{"$f":"+'HULP-velden'!AP178","v":52.5}]
[null,null,null,null,null,null,null,{"$f":"'HULP-velden'!AE179","v":344000},null,{"$f":"+'HULP-velden'!AJ179","v":-8},{"$f":"+'HULP-velden'!AK179","v":2},{"$f":"+'HULP-velden'!AL179","v":12},{"$f":"+'HULP-velden'!AM179","v":22},{"$f":"+'HULP-velden'!AN179","v":32},{"$f":"+'HULP-velden'!AO179","v":42},{"$f":"+'HULP-velden'!AP179","v":52}]
[null,null,null,null,null,null,null,{"$f":"'HULP-velden'!AE180","v":343000},null,{"$f":"+'HULP-velden'!AJ180","v":-8.5},{"$f":"+'HULP-velden'!AK180","v":1.5},{"$f":"+'HULP-velden'!AL180","v":11.5},{"$f":"+'HULP-velden'!AM180","v":21.5},{"$f":"+'HULP-velden'!AN180","v":31.5},{"$f":"+'HULP-velden'!AO180","v":41.5},{"$f":"+'HULP-velden'!AP180","v":51.5}]
[null,null,null,null,null,null,null,{"$f":"'HULP-velden'!AE181","v":342000},null,{"$f":"+'HULP-velden'!AJ181","v":-9},{"$f":"+'HULP-velden'!AK181","v":1},{"$f":"+'HULP-velden'!AL181","v":11},{"$f":"+'HULP-velden'!AM181","v":21},{"$f":"+'HULP-velden'!AN181","v":31},{"$f":"+'HULP-velden'!AO181","v":41},{"$f":"+'HULP-velden'!AP181","v":51}]
[null,null,null,null,null,null,null,{"$f":"'HULP-velden'!AE182","v":341000},null,{"$f":"+'HULP-velden'!AJ182","v":-9.5},{"$f":"+'HULP-velden'!AK182","v":0.5},{"$f":"+'HULP-velden'!AL182","v":10.5},{"$f":"+'HULP-velden'!AM182","v":20.5},{"$f":"+'HULP-velden'!AN182","v":30.5},{"$f":"+'HULP-velden'!AO182","v":40.5},{"$f":"+'HULP-velden'!AP182","v":50.5}]
[null,null,null,null,null,null,null,{"$f":"'HULP-velden'!AE183","v":340000},null,{"$f":"+'HULP-velden'!AJ183","v":-10},{"$f":"+'HULP-velden'!AK183","v":0},{"$f":"+'HULP-velden'!AL183","v":10},{"$f":"+'HULP-velden'!AM183","v":20},{"$f":"+'HULP-velden'!AN183","v":30},{"$f":"+'HULP-velden'!AO183","v":40},{"$f":"+'HULP-velden'!AP183","v":50}]
[null,null,null,null,null,null,null,{"$f":"'HULP-velden'!AE184","v":339000},null,{"$f":"+'HULP-velden'!AJ184","v":-10.5},{"$f":"+'HULP-velden'!AK184","v":-0.5},{"$f":"+'HULP-velden'!AL184","v":9.5},{"$f":"+'HULP-velden'!AM184","v":19.5},{"$f":"+'HULP-velden'!AN184","v":29.5},{"$f":"+'HULP-velden'!AO184","v":39.5},{"$f":"+'HULP-velden'!AP184","v":49.5}]
[null,null,null,null,null,null,null,{"$f":"'HULP-velden'!AE185","v":338000},null,{"$f":"+'HULP-velden'!AJ185","v":-11},{"$f":"+'HULP-velden'!AK185","v":-1},{"$f":"+'HULP-velden'!AL185","v":9},{"$f":"+'HULP-velden'!AM185","v":19},{"$f":"+'HULP-velden'!AN185","v":28.999999999999996},{"$f":"+'HULP-velden'!AO185","v":39},{"$f":"+'HULP-velden'!AP185","v":49}]
[null,null,null,null,null,null,null,{"$f":"'HULP-velden'!AE186","v":337000},null,{"$f":"+'HULP-velden'!AJ186","v":-11.5},{"$f":"+'HULP-velden'!AK186","v":-1.5},{"$f":"+'HULP-velden'!AL186","v":8.5},{"$f":"+'HULP-velden'!AM186","v":18.5},{"$f":"+'HULP-velden'!AN186","v":28.499999999999996},{"$f":"+'HULP-velden'!AO186","v":38.5},{"$f":"+'HULP-velden'!AP186","v":48.5}]
[null,null,null,null,null,null,null,{"$f":"'HULP-velden'!AE187","v":336000},null,{"$f":"+'HULP-velden'!AJ187","v":-12},{"$f":"+'HULP-velden'!AK187","v":-2},{"$f":"+'HULP-velden'!AL187","v":8},{"$f":"+'HULP-velden'!AM187","v":18},{"$f":"+'HULP-velden'!AN187","v":28.000000000000004},{"$f":"+'HULP-velden'!AO187","v":38},{"$f":"+'HULP-velden'!AP187","v":48}]
[null,null,null,null,null,null,null,{"$f":"'HULP-velden'!AE188","v":335000},null,{"$f":"+'HULP-velden'!AJ188","v":-12.5},{"$f":"+'HULP-velden'!AK188","v":-2.5},{"$f":"+'HULP-velden'!AL188","v":7.5},{"$f":"+'HULP-velden'!AM188","v":17.5},{"$f":"+'HULP-velden'!AN188","v":27.500000000000004},{"$f":"+'HULP-velden'!AO188","v":37.5},{"$f":"+'HULP-velden'!AP188","v":47.5}]
[null,null,null,null,null,null,null,{"$f":"'HULP-velden'!AE189","v":334000},null,{"$f":"+'HULP-velden'!AJ189","v":-13},{"$f":"+'HULP-velden'!AK189","v":-3},{"$f":"+'HULP-velden'!AL189","v":7.0000000000000009},{"$f":"+'HULP-velden'!AM189","v":17},{"$f":"+'HULP-velden'!AN189","v":27},{"$f":"+'HULP-velden'!AO189","v":37},{"$f":"+'HULP-velden'!AP189","v":47}]
[null,null,null,null,null,null,null,{"$f":"'HULP-velden'!AE190","v":333000},null,{"$f":"+'HULP-velden'!AJ190","v":-13.5},{"$f":"+'HULP-velden'!AK190","v":-3.5000000000000004},{"$f":"+'HULP-velden'!AL190","v":6.5},{"$f":"+'HULP-velden'!AM190","v":16.5},{"$f":"+'HULP-velden'!AN190","v":26.5},{"$f":"+'HULP-velden'!AO190","v":36.5},{"$f":"+'HULP-velden'!AP190","v":46.5}]
[null,null,null,null,null,null,null,{"$f":"'HULP-velden'!AE191","v":332000},null,{"$f":"+'HULP-velden'!AJ191","v":-14.000000000000002},{"$f":"+'HULP-velden'!AK191","v":-4},{"$f":"+'HULP-velden'!AL191","v":6},{"$f":"+'HULP-velden'!AM191","v":16},{"$f":"+'HULP-velden'!AN191","v":26},{"$f":"+'HULP-velden'!AO191","v":36},{"$f":"+'HULP-velden'!AP191","v":46}]
[null,null,null,null,null,null,null,{"$f":"'HULP-velden'!AE192","v":331000},null,{"$f":"+'HULP-velden'!AJ192","v":-14.499999999999998},{"$f":"+'HULP-velden'!AK192","v":-4.5},{"$f":"+'HULP-velden'!AL192","v":5.5},{"$f":"+'HULP-velden'!AM192","v":15.5},{"$f":"+'HULP-velden'!AN192","v":25.5},{"$f":"+'HULP-velden'!AO192","v":35.5},{"$f":"+'HULP-velden'!AP192","v":45.5}]
[null,null,null,null,null,null,null,{"$f":"'HULP-velden'!AE193","v":330000},null,{"$f":"+'HULP-velden'!AJ193","v":-15},{"$f":"+'HULP-velden'!AK193","v":-5},{"$f":"+'HULP-velden'!AL193","v":5},{"$f":"+'HULP-velden'!AM193","v":15},{"$f":"+'HULP-velden'!AN193","v":25},{"$f":"+'HULP-velden'!AO193","v":35},{"$f":"+'HULP-velden'!AP193","v":45}]
[null,null,null,null,null,null,null,{"$f":"'HULP-velden'!AE194","v":329000},null,{"$f":"+'HULP-velden'!AJ194","v":-15.5},{"$f":"+'HULP-velden'!AK194","v":-5.5},{"$f":"+'HULP-velden'!AL194","v":4.5},{"$f":"+'HULP-velden'!AM194","v":14.499999999999998},{"$f":"+'HULP-velden'!AN194","v":24.5},{"$f":"+'HULP-velden'!AO194","v":34.5},{"$f":"+'HULP-velden'!AP194","v":44.5}]
[null,null,null,null,null,null,null,{"$f":"'HULP-velden'!AE195","v":328000},null,{"$f":"+'HULP-velden'!AJ195","v":-16},{"$f":"+'HULP-velden'!AK195","v":-6},{"$f":"+'HULP-velden'!AL195","v":4},{"$f":"+'HULP-velden'!AM195","v":14.000000000000002},{"$f":"+'HULP-velden'!AN195","v":24},{"$f":"+'HULP-velden'!AO195","v":34},{"$f":"+'HULP-velden'!AP195","v":44}]
[null,null,null,null,null,null,null,{"$f":"'HULP-velden'!AE196","v":327000},null,{"$f":"+'HULP-velden'!AJ196","v":-16.5},{"$f":"+'HULP-velden'!AK196","v":-6.5},{"$f":"+'HULP-velden'!AL196","v":3.5000000000000004},{"$f":"+'HULP-velden'!AM196","v":13.5},{"$f":"+'HULP-velden'!AN196","v":23.5},{"$f":"+'HULP-velden'!AO196","v":33.5},{"$f":"+'HULP-velden'!AP196","v":43.5}]
[null,null,null,null,null,null,null,{"$f":"'HULP-velden'!AE197","v":326000},null,{"$f":"+'HULP-velden'!AJ197","v":-17},{"$f":"+'HULP-velden'!AK197","v":-7.0000000000000009},{"$f":"+'HULP-velden'!AL197","v":3},{"$f":"+'HULP-velden'!AM197","v":13},{"$f":"+'HULP-velden'!AN197","v":23},{"$f":"+'HULP-velden'!AO197","v":33},{"$f":"+'HULP-velden'!AP197","v":43}]
[null,null,null,null,null,null,null,{"$f":"'HULP-velden'!AE198","v":325000},null,{"$f":"+'HULP-velden'!AJ198","v":-17.5},{"$f":"+'HULP-velden'!AK198","v":-7.5},{"$f":"+'HULP-velden'!AL198","v":2.5},{"$f":"+'HULP-velden'!AM198","v":12.5},{"$f":"+'HULP-velden'!AN198","v":22.5},{"$f":"+'HULP-velden'!AO198","v":32.5},{"$f":"+'HULP-velden'!AP198","v":42.5}]
[null,null,null,null,null,null,null,{"$f":"'HULP-velden'!AE199","v":324000},null,{"$f":"+'HULP-velden'!AJ199","v":-18},{"$f":"+'HULP-velden'!AK199","v":-8},{"$f":"+'HULP-velden'!AL199","v":2},{"$f":"+'HULP-velden'!AM199","v":12},{"$f":"+'HULP-velden'!AN199","v":22},{"$f":"+'HULP-velden'!AO199","v":32},{"$f":"+'HULP-velden'!AP199","v":42}]
[null,null,null,null,null,null,null,{"$f":"'HULP-velden'!AE200","v":323000},null,{"$f":"+'HULP-velden'!AJ200","v":-18.5},{"$f":"+'HULP-velden'!AK200","v":-8.5},{"$f":"+'HULP-velden'!AL200","v":1.5},{"$f":"+'HULP-velden'!AM200","v":11.5},{"$f":"+'HULP-velden'!AN200","v":21.5},{"$f":"+'HULP-velden'!AO200","v":31.5},{"$f":"+'HULP-velden'!AP200","v":41.5}]
[null,null,null,null,null,null,null,{"$f":"'HULP-velden'!AE201","v":322000},null,{"$f":"+'HULP-velden'!AJ201","v":-19},{"$f":"+'HULP-velden'!AK201","v":-9},{"$f":"+'HULP-velden'!AL201","v":1},{"$f":"+'HULP-velden'!AM201","v":11},{"$f":"+'HULP-velden'!AN201","v":21},{"$f":"+'HULP-velden'!AO201","v":31},{"$f":"+'HULP-velden'!AP201","v":41}]
[null,null,null,null,null,null,null,{"$f":"'HULP-velden'!AE202","v":321000},null,{"$f":"+'HULP-velden'!AJ202","v":-19.5},{"$f":"+'HULP-velden'!AK202","v":-9.5},{"$f":"+'HULP-velden'!AL202","v":0.5},{"$f":"+'HULP-velden'!AM202","v":10.5},{"$f":"+'HULP-velden'!AN202","v":20.5},{"$f":"+'HULP-velden'!AO202","v":30.5},{"$f":"+'HULP-velden'!AP202","v":40.5}]
[null,null,null,null,null,null,null,{"$f":"'HULP-velden'!AE203","v":320000},null,{"$f":"+'HULP-velden'!AJ203","v":-20},{"$f":"+'HULP-velden'!AK203","v":-10},{"$f":"+'HULP-velden'!AL203","v":0},{"$f":"+'HULP-velden'!AM203","v":10},{"$f":"+'HULP-velden'!AN203","v":20},{"$f":"+'HULP-velden'!AO203","v":30},{"$f":"+'HULP-velden'!AP203","v":40}]
[null,null,null,null,null,null,null,{"$f":"'HULP-velden'!AE204","v":319000},null,{"$f":"+'HULP-velden'!AJ204","v":-20.5},{"$f":"+'HULP-velden'!AK204","v":-10.5},{"$f":"+'HULP-velden'!AL204","v":-0.5},{"$f":"+'HULP-velden'!AM204","v":9.5},{"$f":"+'HULP-velden'!AN204","v":19.5},{"$f":"+'HULP-velden'!AO204","v":29.5},{"$f":"+'HULP-velden'!AP204","v":39.5}]
[null,null,null,null,null,null,null,{"$f":"'HULP-velden'!AE205","v":318000},null,{"$f":"+'HULP-velden'!AJ205","v":-21},{"$f":"+'HULP-velden'!AK205","v":-11},{"$f":"+'HULP-velden'!AL205","v":-1},{"$f":"+'HULP-velden'!AM205","v":9},{"$f":"+'HULP-velden'!AN205","v":19},{"$f":"+'HULP-velden'!AO205","v":28.999999999999996},{"$f":"+'HULP-velden'!AP205","v":39}]
[null,null,null,null,null,null,null,{"$f":"'HULP-velden'!AE206","v":317000},null,{"$f":"+'HULP-velden'!AJ206","v":-21.5},{"$f":"+'HULP-velden'!AK206","v":-11.5},{"$f":"+'HULP-velden'!AL206","v":-1.5},{"$f":"+'HULP-velden'!AM206","v":8.5},{"$f":"+'HULP-velden'!AN206","v":18.5},{"$f":"+'HULP-velden'!AO206","v":28.499999999999996},{"$f":"+'HULP-velden'!AP206","v":38.5}]
[null,null,null,null,null,null,null,{"$f":"'HULP-velden'!AE207","v":316000},null,{"$f":"+'HULP-velden'!AJ207","v":-22},{"$f":"+'HULP-velden'!AK207","v":-12},{"$f":"+'HULP-velden'!AL207","v":-2},{"$f":"+'HULP-velden'!AM207","v":8},{"$f":"+'HULP-velden'!AN207","v":18},{"$f":"+'HULP-velden'!AO207","v":28.000000000000004},{"$f":"+'HULP-velden'!AP207","v":38}]
[null,null,null,null,null,null,null,{"$f":"'HULP-velden'!AE208","v":315000},null,{"$f":"+'HULP-velden'!AJ208","v":-22.5},{"$f":"+'HULP-velden'!AK208","v":-12.5},{"$f":"+'HULP-velden'!AL208","v":-2.5},{"$f":"+'HULP-velden'!AM208","v":7.5},{"$f":"+'HULP-velden'!AN208","v":17.5},{"$f":"+'HULP-velden'!AO208","v":27.500000000000004},{"$f":"+'HULP-velden'!AP208","v":37.5}]
[null,null,null,null,null,null,null,{"$f":"'HULP-velden'!AE209","v":314000},null,{"$f":"+'HULP-velden'!AJ209","v":-23},{"$f":"+'HULP-velden'!AK209","v":-13},{"$f":"+'HULP-velden'!AL209","v":-3},{"$f":"+'HULP-velden'!AM209","v":7.0000000000000009},{"$f":"+'HULP-velden'!AN209","v":17},{"$f":"+'HULP-velden'!AO209","v":27},{"$f":"+'HULP-velden'!AP209","v":37}]
[null,null,null,null,null,null,null,{"$f":"'HULP-velden'!AE210","v":313000},null,{"$f":"+'HULP-velden'!AJ210","v":-23.5},{"$f":"+'HULP-velden'!AK210","v":-13.5},{"$f":"+'HULP-velden'!AL210","v":-3.5000000000000004},{"$f":"+'HULP-velden'!AM210","v":6.5},{"$f":"+'HULP-velden'!AN210","v":16.5},{"$f":"+'HULP-velden'!AO210","v":26.5},{"$f":"+'HULP-velden'!AP210","v":36.5}]
[null,null,null,null,null,null,null,{"$f":"'HULP-velden'!AE211","v":312000},null,{"$f":"+'HULP-velden'!AJ211","v":-24},{"$f":"+'HULP-velden'!AK211","v":-14.000000000000002},{"$f":"+'HULP-velden'!AL211","v":-4},{"$f":"+'HULP-velden'!AM211","v":6},{"$f":"+'HULP-velden'!AN211","v":16},{"$f":"+'HULP-velden'!AO211","v":26},{"$f":"+'HULP-velden'!AP211","v":36}]
[null,null,null,null,null,null,null,{"$f":"'HULP-velden'!AE212","v":311000},null,{"$f":"+'HULP-velden'!AJ212","v":-24.5},{"$f":"+'HULP-velden'!AK212","v":-14.499999999999998},{"$f":"+'HULP-velden'!AL212","v":-4.5},{"$f":"+'HULP-velden'!AM212","v":5.5},{"$f":"+'HULP-velden'!AN212","v":15.5},{"$f":"+'HULP-velden'!AO212","v":25.5},{"$f":"+'HULP-velden'!AP212","v":35.5}]
[null,null,null,null,null,null,null,{"$f":"'HULP-velden'!AE213","v":310000},null,{"$f":"+'HULP-velden'!AJ213","v":-25},{"$f":"+'HULP-velden'!AK213","v":-15},{"$f":"+'HULP-velden'!AL213","v":-5},{"$f":"+'HULP-velden'!AM213","v":5},{"$f":"+'HULP-velden'!AN213","v":15},{"$f":"+'HULP-velden'!AO213","v":25},{"$f":"+'HULP-velden'!AP213","v":35}]
[null,null,null,null,null,null,null,{"$f":"'HULP-velden'!AE214","v":309000},null,{"$f":"+'HULP-velden'!AJ214","v":-25.5},{"$f":"+'HULP-velden'!AK214","v":-15.5},{"$f":"+'HULP-velden'!AL214","v":-5.5},{"$f":"+'HULP-velden'!AM214","v":4.5},{"$f":"+'HULP-velden'!AN214","v":14.499999999999998},{"$f":"+'HULP-velden'!AO214","v":24.5},{"$f":"+'HULP-velden'!AP214","v":34.5}]
[null,null,null,null,null,null,null,{"$f":"'HULP-velden'!AE215","v":308000},null,{"$f":"+'HULP-velden'!AJ215","v":-26},{"$f":"+'HULP-velden'!AK215","v":-16},{"$f":"+'HULP-velden'!AL215","v":-6},{"$f":"+'HULP-velden'!AM215","v":4},{"$f":"+'HULP-velden'!AN215","v":14.000000000000002},{"$f":"+'HULP-velden'!AO215","v":24},{"$f":"+'HULP-velden'!AP215","v":34}]
[null,null,null,null,null,null,null,{"$f":"'HULP-velden'!AE216","v":307000},null,{"$f":"+'HULP-velden'!AJ216","v":-26.5},{"$f":"+'HULP-velden'!AK216","v":-16.5},{"$f":"+'HULP-velden'!AL216","v":-6.5},{"$f":"+'HULP-velden'!AM216","v":3.5000000000000004},{"$f":"+'HULP-velden'!AN216","v":13.5},{"$f":"+'HULP-velden'!AO216","v":23.5},{"$f":"+'HULP-velden'!AP216","v":33.5}]
[null,null,null,null,null,null,null,{"$f":"'HULP-velden'!AE217","v":306000},null,{"$f":"+'HULP-velden'!AJ217","v":-27},{"$f":"+'HULP-velden'!AK217","v":-17},{"$f":"+'HULP-velden'!AL217","v":-7.0000000000000009},{"$f":"+'HULP-velden'!AM217","v":3},{"$f":"+'HULP-velden'!AN217","v":13},{"$f":"+'HULP-velden'!AO217","v":23},{"$f":"+'HULP-velden'!AP217","v":33}]
[null,null,null,null,null,null,null,{"$f":"'HULP-velden'!AE218","v":305000},null,{"$f":"+'HULP-velden'!AJ218","v":-27.500000000000004},{"$f":"+'HULP-velden'!AK218","v":-17.5},{"$f":"+'HULP-velden'!AL218","v":-7.5},{"$f":"+'HULP-velden'!AM218","v":2.5},{"$f":"+'HULP-velden'!AN218","v":12.5},{"$f":"+'HULP-velden'!AO218","v":22.5},{"$f":"+'HULP-velden'!AP218","v":32.5}]
[null,null,null,null,null,null,null,{"$f":"'HULP-velden'!AE219","v":304000},null,{"$f":"+'HULP-velden'!AJ219","v":-28.000000000000004},{"$f":"+'HULP-velden'!AK219","v":-18},{"$f":"+'HULP-velden'!AL219","v":-8},{"$f":"+'HULP-velden'!AM219","v":2},{"$f":"+'HULP-velden'!AN219","v":12},{"$f":"+'HULP-velden'!AO219","v":22},{"$f":"+'HULP-velden'!AP219","v":32}]
[null,null,null,null,null,null,null,{"$f":"'HULP-velden'!AE220","v":303000},null,{"$f":"+'HULP-velden'!AJ220","v":-28.499999999999996},{"$f":"+'HULP-velden'!AK220","v":-18.5},{"$f":"+'HULP-velden'!AL220","v":-8.5},{"$f":"+'HULP-velden'!AM220","v":1.5},{"$f":"+'HULP-velden'!AN220","v":11.5},{"$f":"+'HULP-velden'!AO220","v":21.5},{"$f":"+'HULP-velden'!AP220","v":31.5}]
[null,null,null,null,null,null,null,{"$f":"'HULP-velden'!AE221","v":302000},null,{"$f":"+'HULP-velden'!AJ221","v":-28.999999999999996},{"$f":"+'HULP-velden'!AK221","v":-19},{"$f":"+'HULP-velden'!AL221","v":-9},{"$f":"+'HULP-velden'!AM221","v":1},{"$f":"+'HULP-velden'!AN221","v":11},{"$f":"+'HULP-velden'!AO221","v":21},{"$f":"+'HULP-velden'!AP221","v":31}]
[null,null,null,null,null,null,null,{"$f":"'HULP-velden'!AE222","v":301000},null,{"$f":"+'HULP-velden'!AJ222","v":-29.5},{"$f":"+'HULP-velden'!AK222","v":-19.5},{"$f":"+'HULP-velden'!AL222","v":-9.5},{"$f":"+'HULP-velden'!AM222","v":0.5},{"$f":"+'HULP-velden'!AN222","v":10.5},{"$f":"+'HULP-velden'!AO222","v":20.5},{"$f":"+'HULP-velden'!AP222","v":30.5}]
[null,null,null,null,null,null,null,{"$f":"'HULP-velden'!AE223","v":300000},null,{"$f":"+'HULP-velden'!AJ223","v":-30},{"$f":"+'HULP-velden'!AK223","v":-20},{"$f":"+'HULP-velden'!AL223","v":-10},{"$f":"+'HULP-velden'!AM223","v":0},{"$f":"+'HULP-velden'!AN223","v":10},{"$f":"+'HULP-velden'!AO223","v":20},{"$f":"+'HULP-velden'!AP223","v":30}]